program: Gaussian 09
title: 000146541
version: EM64L-G09RevD.01
frameworkgroup: C1[X(C6H16N3O2P)]
method: RPBEPBE
basis: SDD
operation: Freq
keyword: #p
keyword: freq=noraman
keyword: PBEPBE/SDD
title: #p freq=noraman PBEPBE/SDD
converged: YES YES NO NO
title: Mulliken charges:
elementType: P O O N N N C C C C C C H H H H H H H H H H H H H H H H
charge: 1.384837 -0.618143 -0.261131 -0.492034 -0.476898 -0.461091 -0.571309 -0.579528 -0.582844 -0.573459 -0.601922 -0.020978 0.221558 0.277397 0.220421 0.226404 0.222922 0.253257 0.227672 0.255875 0.235475 0.249842 0.226900 0.235178 0.281027 0.239578 0.239221 0.241776
chargesum: 0.00000
title: Mulliken charges with hydrogens summed into heavy atoms:
elementType: P O O N N N C C C C C C
charge: 1.384837 -0.618143 -0.261131 -0.492034 -0.476898 -0.461091 0.148067 0.123055 0.136177 0.138461 0.157904 0.220798
polarizability: 1.32197928e+02 -3.70908451e-01 1.09555650e+02 4.08311226e+00 9.01022203e-01 1.03040308e+02
1716.lowfreq: -30.9178 -21.7283 -15.0673 -0.0007 0.0015 0.0019 19.4279 55.4122 63.5102
frequency: -11.7916 54.8053 63.3220 91.3410 102.7750 117.1993 123.8811 169.7276 171.9989 187.4674 194.4280 214.8497 221.1368 254.1207 270.2832 294.2579 307.2178 329.4602 337.3799 353.2631 370.8304 421.8545 439.7038 498.9199 615.5095 684.3688 785.6801 939.2035 952.5044 965.2511 992.3516 1017.1249 1054.6225 1066.5508 1090.5088 1095.3166 1120.1427 1133.6284 1136.2517 1146.4930 1177.3516 1207.7131 1258.3960 1266.2289 1278.7858 1370.8481 1407.4199 1419.7239 1422.7680 1436.4771 1440.2040 1456.5499 1467.8217 1470.3890 1474.9656 1478.1079 1479.2307 1483.4426 1490.0338 1495.2591 1500.6450 1610.3759 2939.8191 2949.2867 2950.0543 2953.0701 2983.8288 3009.1653 3015.3093 3025.5675 3033.8001 3037.1436 3074.4727 3092.3172 3093.3331 3098.1186 3099.3326 3104.2694
redmass: 2.0166 2.1664 2.0532 2.7177 2.3168 2.6573 2.0770 1.3726 1.4534 1.7957 1.3385 1.5699 2.1497 3.5166 3.4944 3.4094 3.4756 3.6660 3.5432 4.3172 2.9413 3.8167 3.7907 6.3304 6.7445 6.7480 4.2436 3.1496 3.0509 3.1314 1.5661 7.9520 1.4115 1.3416 1.2161 1.2122 1.3168 1.3735 1.3517 2.1360 5.1619 6.6481 2.1160 5.2314 2.2302 1.2300 1.1417 1.1240 1.1228 1.1388 1.1447 1.0457 1.0463 1.0504 1.0487 1.0460 1.0475 1.0519 1.0532 1.0520 1.0575 6.0392 1.0372 1.0400 1.0362 1.0398 1.0327 1.1001 1.0908 1.1017 1.0963 1.0966 1.1021 1.0964 1.0978 1.0980 1.1005 1.0973
irintensity: 0.1649 0.5023 1.3104 0.9028 1.3065 1.3564 2.3429 1.1113 1.2186 3.3238 3.0559 6.8278 4.5298 7.5283 4.1104 8.0859 4.7340 15.8455 1.3033 8.0619 21.6963 26.9588 9.3736 56.4749 111.6387 96.9825 11.2583 270.3874 213.4443 82.3701 4.3372 80.3281 9.6639 7.1029 0.1667 0.0763 4.2572 1.3262 0.7047 27.3798 59.8881 42.7410 10.5782 146.2218 16.4277 48.5765 30.3669 10.3666 27.1148 0.5470 3.8913 3.5672 5.4175 24.3217 3.2723 33.2905 10.4026 44.0784 5.6281 5.6913 5.9858 335.6163 65.9154 44.5401 157.6345 66.9783 39.5211 60.1513 8.8098 34.5945 59.4817 5.3305 27.6198 6.7353 10.2895 10.9141 1.6960 14.7930
temp: 298.150 k
press: 1.00000 atm
elementType: 15 8 8 7 7 7 6 6 6 6 6 6 1 1 1 1 1 1 1 1 1 1 1 1 1 1 1 1
symmnumber: 1
zpe: 603739.5 jmol-1
zpe.correction: 0.229952 hartree
zpe.thermalcorrener: 0.245669 hartree
zpe.thermalcorrenthalpy: 0.246614 hartree
zpe.thermalcorrgfe: 0.187733 hartree
zpe.sumelectzpe: -893.141169 hartree
zpe.sumelectthermal: -893.125452 hartree
zpe.sumelectthermalent: -893.124508 hartree
zpe.sumelectthermalfe: -893.183389 hartree
dipole: 5.3802 1.3858 3.9140
dipole: 6.7960
quadrupole: -94.9678 -72.6551 -86.1193
quadrupole: -3.6229 0.6323 -1.4435
quadrupole: -10.3870 11.9256 -1.5386 -3.6229 0.6323 -1.4435
hfenergy: -893.3711215 hartree
pointgroup: C01 [X(C6H16N3O2P1)]
dipole: 2.2124942 -0.4860978 1.4204242 debye
polarizability: 128.7307369|-8.725264|113.2472401|2.2800537|0.6968591|102.8159094 unknown
InChI: InChI=1S/C6H16N3O2P/c1-7(2)12(11,8(3)4)9(5)6-10/h6H,1-5H3
charge 0 multiplicity 1
28 atoms
P  0.19209 -0.07752 -0.544165
O  -0.134558 -0.064487 -2.113324
O  -3.562802 0.981893 0.184325
N  0.805408 -1.615059 -0.02648
N  1.339134 1.04175 0.165267
N  -1.305875 0.352392 0.360555
C  0.572671 -2.791269 -0.88507
C  1.36645 -1.877411 1.307483
C  0.949904 2.457517 0.348174
C  2.771637 0.857726 -0.163366
C  -1.382758 0.20932 1.82987
C  -2.455441 0.720522 -0.357946
H  1.527154 -3.325431 -1.060205
H  0.175376 -2.458398 -1.858557
H  -0.146757 -3.497002 -0.42193
H  2.336089 -2.406482 1.212809
H  0.690184 -2.511653 1.917847
H  1.542287 -0.928447 1.840033
H  1.542974 2.885592 1.177609
H  -0.117892 2.535615 0.608191
H  1.133352 3.063644 -0.563623
H  2.988542 -0.209621 -0.332051
H  3.386561 1.212491 0.684851
H  3.065138 1.422727 -1.072479
H  -2.367349 0.595314 2.142928
H  -0.580886 0.784449 2.324894
H  -1.30706 -0.8513 2.130005
H  -2.274372 0.754629 -1.450646
