program: Gaussian 09
title: 000146531
version: EM64L-G09RevD.01
frameworkgroup: C1[X(C8H7N3O2)]
method: RPBEPBE
basis: SDD
operation: Freq
keyword: #pfreq=noraman
keyword: PBEPBE/SDD
title: #p freq=noraman PBEPBE/SDD
converged: YES YES NO NO
title: Mulliken charges:
elementType: O O N N N C C C C C C C C H H H H H H H
charge: -0.288240 -0.250025 -0.144105 0.015878 -0.060635 0.245059 -0.329972 -0.312880 0.326158 -0.339506 -0.335967 0.186069 -0.499239 0.276190 0.277354 0.256450 0.254444 0.233747 0.244741 0.244479
chargesum: 0.00000
title: Mulliken charges with hydrogens summed into heavy atoms:
elementType: O O N N N C C C C C C C C
charge: -0.288240 -0.250025 -0.144105 0.015878 -0.060635 0.245059 -0.053783 -0.035527 0.326158 -0.083057 -0.081523 0.186069 0.223729
polarizability: 2.02588276e+02 -3.01125790e+00 1.01952772e+02 1.14715047e+01 5.54040848e-01 6.23981594e+01
1716.lowfreq: -85.7995 -0.0007 -0.0007 -0.0006 4.6803 5.7998 11.1711 50.2940 65.0247
frequency: -85.7980 50.2895 65.0235 107.8030 125.9947 133.9582 183.3569 280.1996 298.9314 324.4032 351.5919 408.8895 458.0550 467.7021 485.2306 526.3936 621.7228 628.9339 679.9117 727.6347 758.9824 786.8538 847.9136 866.7460 920.0350 982.6243 993.0411 1008.3355 1069.0023 1084.0703 1110.4984 1114.7574 1149.8338 1180.1168 1251.9646 1294.7149 1331.1595 1367.3645 1407.5880 1424.7962 1452.9718 1463.8376 1490.1982 1570.6431 1609.1345 1626.0304 2059.9447 3005.7156 3107.8762 3150.5109 3154.0298 3158.7341 3173.0758 3184.6736
redmass: 8.2015 5.5787 5.9599 1.3899 2.6879 4.5741 5.5366 6.4632 5.7566 7.1651 6.5502 2.9323 9.4566 7.0950 4.6100 5.3579 7.5917 7.1780 4.1370 6.0466 4.7490 6.4612 1.2464 1.6889 8.0712 1.3561 1.3637 3.3326 5.1433 3.7769 1.3679 1.2639 1.4749 1.1295 3.9716 1.2691 7.6770 5.9452 3.8132 1.1890 1.0494 1.0517 2.6858 7.9981 6.3373 10.0362 13.9711 1.0295 1.1046 1.1048 1.0886 1.0899 1.0973 1.0965
irintensity: 0.0954 0.1626 1.3185 1.3629 0.5532 0.3503 8.5729 18.6654 6.7412 0.9760 5.8101 0.0976 1.1643 1.8609 4.5211 12.8492 1.3111 0.7879 27.9611 3.3665 16.6365 7.4446 1.0280 65.1098 3.8301 0.7598 0.2021 43.1654 169.4087 50.9161 9.3989 0.0442 64.1766 21.8643 293.1836 1.3683 104.5975 5.3703 14.2078 40.5845 14.6545 12.1080 61.8241 8.9064 99.1702 220.0155 460.4853 38.8392 25.4037 15.2082 0.5794 3.2728 4.3910 1.5627
temp: 298.150 k
press: 1.00000 atm
elementType: 8 8 7 7 7 6 6 6 6 6 6 6 6 1 1 1 1 1 1 1
symmnumber: 1
zpe: 371343.6 jmol-1
zpe.correction: 0.141437 hartree
zpe.thermalcorrener: 0.152642 hartree
zpe.thermalcorrenthalpy: 0.153586 hartree
zpe.thermalcorrgfe: 0.103313 hartree
zpe.sumelectzpe: -622.764922 hartree
zpe.sumelectthermal: -622.753718 hartree
zpe.sumelectthermalent: -622.752773 hartree
zpe.sumelectthermalfe: -622.803046 hartree
dipole: -2.1590 -1.5910 -0.1185
dipole: 2.6845
quadrupole: -78.2266 -70.8488 -78.0092
quadrupole: 9.5119 -2.5781 0.0058
quadrupole: -2.5318 4.8461 -2.3143 9.5119 -2.5781 0.0058
hfenergy: -622.9063592 hartree
pointgroup: C01 [X(C8H7N3O2)]
dipole: -0.8398807 -0.6373052 -0.0625555 debye
dipolederiv: -1.3006748 -0.3714293 0.0467781 -0.7718303 -0.8739082 0.0125243 0.0467587 -0.0086723 -0.2992268 -0.9163871 0.2602609 0.0588799 0.128224 -0.8325801 -0.0462351 0.0806035 -0.0764301 -0.3349124 -1.3485773 0.0992637 -0.4150639 0.1296333 -0.2693554 0.0549714 -0.5571605 0.0625818 -0.5535396 1.2653887 -0.1472315 0.8606302 -0.1789014 0.1228022 -0.1156086 1.0007348 -0.1183249 0.7509153 -0.8986582 0.0814016 -0.3984155 0.1018185 -0.1028798 0.0489152 -0.4969032 0.0501748 -0.3400351 -0.7381504 0.0148372 0.0369066 0.0021238 -0.0724985 -0.003923 0.0905348 -0.0075564 -0.0143013 0.151079 -0.1120455 -0.0335043 0.1528712 0.037566 0.0165166 -0.0491272 0.0289985 -0.1020081 0.1656689 0.0918558 -0.0194751 -0.1348092 0.0256495 0.0068579 -0.0742327 0.0023822 -0.1055641 1.4146581 -0.0689023 0.071718 -0.0740718 0.3170337 0.0181642 0.0583775 0.0191505 0.059401 -0.3802115 0.1589435 -0.039403 0.2356246 -0.0294694 -0.0261473 0.0347247 -0.0077981 -0.1234887 -0.4326814 -0.1026895 -0.0566205 -0.2016906 0.000885 0.0508407 0.003694 0.022643 -0.1151153 2.0591036 0.0343988 -0.1250637 0.5099436 1.3403905 0.0466801 -0.158845 0.0943576 0.2601315 0.7504408 0.1678105 -0.0235128 0.1211472 0.2620181 -0.0118558 -0.0433484 -0.0211514 0.281666 0.0926023 0.0678365 0.0048802 0.0369615 0.0235851 -0.0149348 0.0106514 -0.0187279 0.1526239 0.0854678 -0.0584541 -0.0055218 -0.0650728 0.0225559 -0.0058237 0.0012293 -0.0062762 0.1550858 0.0384181 -0.078517 0.0167259 -0.0830352 0.0051302 -0.011214 0.0147247 -0.0050522 0.1584143 0.0544432 0.066731 0.0284958 0.0763351 -0.0130898 -0.0195528 0.0272356 -0.0245727 0.1544109 0.0340703 -0.0392251 0.0053797 -0.1126126 -0.0939412 -0.0083135 -0.0001663 -0.0145631 0.1206963 -0.0585077 -0.0229933 -0.0304093 0.0809214 0.0512027 0.0981711 -0.0626524 0.0736625 -0.0276281 -0.0374925 -0.0418518 0.0165954 0.0464197 0.0789033 -0.0900328 0.0731669 -0.0448256 -0.0775256 unknown
polarizability: 202.7791684|-1.7943127|101.7950881|10.6369653|2.0125194|62.3649517 unknown
InChI: InChI=1S/C8H7N3O2/c1-13-8(12)6-2-4-7(5-3-6)10-11-9/h2-5H,1H3
charge 0 multiplicity 1
20 atoms
O  -3.188478 -0.951652 0.083595
O  -3.171672 1.36988 0.289644
N  3.146903 -0.024937 -0.646803
N  4.009148 -0.166569 0.26672
N  4.966615 -0.29252 0.956725
C  -1.074851 0.167624 -0.061033
C  -0.298764 1.355407 -0.046215
C  -0.440694 -1.087208 -0.251695
C  1.723857 0.035099 -0.385031
C  1.09743 1.294281 -0.212751
C  0.955995 -1.15515 -0.41925
C  -2.550099 0.291946 0.120204
C  -4.659359 -0.916053 0.260652
H  -0.808712 2.313638 0.095408
H  -1.047978 -1.995865 -0.268787
H  1.704375 2.204793 -0.215815
H  1.456169 -2.11502 -0.580761
H  -4.974177 -1.967303 0.203943
H  -5.125324 -0.316221 -0.538977
H  -4.914882 -0.475068 1.238726
