program: Gaussian 09
title: 000010097
version: EM64L-G09RevD.01
frameworkgroup: C1[X(C17H17ClO6)]
method: RPBEPBE
basis: SDD
operation: Freq
keyword: #p
keyword: freq=noraman
keyword: PBEPBE/SDD
title: #p freq=noraman PBEPBE/SDD
converged: YES YES NO NO
title: Mulliken charges:
elementType: Cl O O O O O O C C C C C C C C C C C C C C C C C H H H H H H H H H H H H H H H H H
charge: -0.000729 -0.250117 -0.249329 -0.248025 -0.190495 -0.263311 -0.267526 0.049092 -0.133177 -0.530585 0.107649 0.182258 -0.734098 -0.021513 0.366779 0.467238 -0.480351 0.270018 -0.638689 -0.556856 0.503263 -0.534608 -0.538284 -0.513806 0.251528 0.242607 0.287633 0.224648 0.247317 0.221053 0.263974 0.283550 0.234216 0.251902 0.239879 0.211730 0.233073 0.295705 0.231260 0.246255 0.238873
chargesum: 0.00000
title: Mulliken charges with hydrogens summed into heavy atoms:
elementType: Cl O O O O O O C C C C C C C C C C C C C C C C C
charge: -0.000729 -0.250117 -0.249329 -0.248025 -0.190495 -0.263311 -0.267526 0.049092 0.118351 -0.000345 0.107649 0.182258 -0.041080 -0.021513 0.366779 0.467238 -0.216376 0.270018 -0.638689 -0.273306 0.503263 0.191390 0.202224 0.202582
polarizability: 3.31156926e+02 1.77552996e+01 2.16045360e+02 1.23231354e+01 1.44036078e+00 1.49226996e+02
1716.lowfreq: -9.1967 -5.9380 -0.0009 -0.0009 -0.0008 2.5137 20.8643 27.8374 32.9405
frequency: 20.7617 27.8094 32.8354 49.8895 66.5827 89.8977 103.1601 120.9102 126.2250 136.4568 149.4503 159.1987 187.8645 191.5794 199.6512 200.7262 215.5277 225.1241 237.2858 239.1316 253.5216 260.0292 272.3242 298.3715 332.4082 345.7669 355.3020 359.8324 394.6982 414.3561 433.7018 473.6415 480.8295 518.6907 547.6750 572.3043 576.2109 592.4636 601.7793 610.7252 632.2582 666.4220 696.6953 705.2859 758.1312 772.6019 823.0512 859.6506 861.3892 866.2521 893.0434 898.0016 917.2836 934.2486 954.4582 969.5353 997.0084 1027.8516 1044.4948 1073.8686 1103.9680 1105.6435 1107.4686 1113.8073 1122.4283 1147.3186 1150.3353 1159.5344 1172.1533 1175.4288 1197.8048 1211.6890 1224.9898 1245.7753 1286.7840 1305.2694 1324.4250 1334.7769 1354.8184 1373.6810 1390.3692 1396.3639 1431.0594 1432.7868 1438.0991 1449.8194 1458.4227 1459.7599 1466.2699 1467.1242 1470.1440 1475.6381 1476.3456 1481.1990 1488.2902 1534.1078 1583.7692 1594.4006 1617.3153 1619.0773 2973.9670 2982.9903 2985.0048 2989.2583 2999.2484 3001.6533 3059.9958 3077.4136 3081.2469 3082.5107 3093.5612 3111.5596 3128.4541 3131.3756 3142.7187 3163.6983 3191.8779
redmass: 3.7848 4.8392 5.2517 5.2566 5.1673 2.6423 3.0837 5.4784 3.9658 2.8266 3.9408 2.5326 2.6456 2.4089 2.2569 1.8972 1.1466 2.9671 1.4950 3.6033 4.2048 4.2949 4.7247 4.5692 9.0829 6.6345 8.8815 9.2802 4.4940 3.9197 4.6849 4.4491 4.9870 5.3184 3.8877 5.8259 4.8913 7.5773 4.7435 5.3733 8.1765 7.3437 6.7942 4.7724 5.6383 5.3694 6.2526 2.1049 1.6781 2.3282 5.6159 2.2376 2.4649 6.3529 5.6980 3.9951 2.4069 3.5489 5.3521 5.6464 1.2564 1.6976 2.6119 1.4199 1.2445 1.4851 1.4960 1.6016 2.3119 2.0427 2.9801 2.4628 1.7774 3.0597 1.4375 4.5697 1.4938 1.4881 6.6026 2.3473 1.2681 4.4909 1.5647 1.2322 1.0936 1.3166 1.0776 1.0721 1.0541 1.0493 1.0543 2.7765 1.0642 1.0542 1.0668 7.9516 10.3170 9.5600 7.7680 8.1465 1.0322 1.0315 1.0368 1.0811 1.0293 1.0621 1.1002 1.0995 1.1047 1.1031 1.0996 1.1044 1.1051 1.1035 1.1018 1.0913 1.0916
irintensity: 6.6808 2.3912 0.9789 1.8208 3.1751 4.3468 0.4233 0.1827 5.7267 3.1222 0.3895 0.5894 1.1558 6.5257 6.7780 1.4320 0.7757 1.2630 0.4936 2.2950 3.1749 6.3400 10.3822 2.5111 0.9447 2.7039 7.2092 1.2659 2.6312 13.1989 2.9078 3.9527 22.9974 1.5933 6.7440 6.0325 6.4002 2.6602 4.9556 26.0759 35.8797 11.0212 16.3786 5.1597 16.0006 6.9130 16.5391 41.5981 31.4931 25.9448 29.5369 8.9906 3.4468 16.0994 21.5901 152.5540 11.2399 9.8929 141.9931 23.0107 0.7499 17.7164 11.8838 2.1758 18.9567 1.7543 23.5729 143.4715 131.3476 263.7643 86.9378 178.9902 2.6881 66.8586 9.5107 52.0268 24.0387 6.5891 117.4779 111.8031 19.1619 35.9660 29.1150 15.4600 46.9169 3.4636 36.3606 6.6602 42.1946 15.7774 27.6219 155.8339 9.9659 10.6241 51.2509 347.4529 174.3844 199.5735 813.0724 15.8858 93.1212 45.6200 17.9824 10.4106 66.6541 11.7268 5.0716 38.3331 28.5681 29.4746 16.0711 28.4487 21.6774 9.7383 19.8672 7.8029 0.1298
temp: 298.150 k
press: 1.00000 atm
elementType: 17 8 8 8 8 8 8 6 6 6 6 6 6 6 6 6 6 6 6 6 6 6 6 6 1 1 1 1 1 1 1 1 1 1 1 1 1 1 1 1 1
symmnumber: 1
zpe: 807307.2 jmol-1
zpe.correction: 0.307487 hartree
zpe.thermalcorrener: 0.331435 hartree
zpe.thermalcorrenthalpy: 0.332380 hartree
zpe.thermalcorrgfe: 0.253095 hartree
zpe.sumelectzpe: -1567.584020 hartree
zpe.sumelectthermal: -1567.560072 hartree
zpe.sumelectthermalent: -1567.559128 hartree
zpe.sumelectthermalfe: -1567.638412 hartree
dipole: 2.3745 0.0194 3.4766
dipole: 4.2102
quadrupole: -105.7879 -146.7600 -147.5657
quadrupole: -0.4392 -11.2011 1.4091
quadrupole: 27.5833 -13.3888 -14.1945 -0.4392 -11.2011 1.4091
hfenergy: -1567.8915075 hartree
pointgroup: C01 [X(C17H17Cl1O6)]
dipole: -0.9283128 0.0178934 1.3717276 debye
polarizability: 326.9732062|26.7879395|219.3331816|-14.5167252|-8.231338|150.1228935 unknown
InChI: InChI=1S/C17H17ClO6/c1-8-5-9(21-2)6-12(19)17(8)16(20)13-10(22-3)7-11(23-4)14(18)15(13)24-17/h6-8H,5H2,1-4H3
charge 0 multiplicity 1
41 atoms
Cl 2.713359 2.800608 0.139823
O  0.226622 1.143121 0.537722
O  -5.181936 -0.29236 0.202449
O  -1.039236 -2.248976 0.272995
O  -1.007714 0.962266 -1.908649
O  2.233334 -3.251802 -0.177747
O  5.048226 0.480131 -0.403845
C  -0.939781 0.224291 0.437604
C  -1.842366 0.445362 1.67701
C  -3.179024 -0.317403 1.506588
C  -0.322718 -1.202065 0.313598
C  -1.675191 0.56752 -0.910575
C  -1.141429 0.0627 2.996484
C  1.125582 -1.013546 0.204937
C  -3.820803 -0.053282 0.169154
C  1.369899 0.393344 0.28535
C  -3.118745 0.363725 -0.941103
C  2.249955 -1.869452 -0.052474
C  2.628057 0.986617 0.113579
C  3.513265 -1.280428 -0.241448
C  3.728238 0.123119 -0.164455
C  -5.949373 -0.148246 -1.049083
C  1.33496 -4.064912 0.675208
C  5.650936 1.727235 0.110377
H  -2.061703 1.532424 1.695421
H  -3.883739 -0.029246 2.30762
H  -3.000877 -1.405638 1.597117
H  -0.926505 -1.020856 3.037115
H  -0.193003 0.614977 3.110803
H  -1.786483 0.312258 3.858466
H  -3.597578 0.547682 -1.907433
H  4.378114 -1.920384 -0.428453
H  -5.900358 0.892682 -1.417759
H  -6.982508 -0.408297 -0.780199
H  -5.566276 -0.841151 -1.819927
H  1.570934 -3.883335 1.741162
H  1.575809 -5.104987 0.410391
H  0.277054 -3.833048 0.471812
H  5.348025 1.917066 1.154477
H  5.379872 2.587266 -0.521636
H  6.733902 1.538319 0.05632
