program: Gaussian 09
title: 000146491
version: EM64L-G09RevD.01
frameworkgroup: C1[X(C9H8N2O2)]
method: RPBEPBE
basis: SDD
operation: Freq
keyword: #pfreq=noraman
keyword: PBEPBE/SDD
title: #p freq=noraman PBEPBE/SDD
converged: YES YES NO YES
title: Mulliken charges:
elementType: O O N N C C C C C C C C C H H H H H H H H
charge: -0.363885 -0.438700 -0.140967 -0.156057 0.211822 0.345717 0.049141 -0.302878 -0.509316 -0.369536 -0.224161 -0.194350 -0.169114 0.289037 0.241209 0.271075 0.276484 0.236790 0.217978 0.366058 0.363653
chargesum: 0.00000
title: Mulliken charges with hydrogens summed into heavy atoms:
elementType: O O N N C C C C C C C C C
charge: 0.002174 -0.075048 -0.140967 -0.156057 0.211822 0.345717 0.049141 -0.013842 -0.268107 -0.098461 0.052323 0.042440 0.048864
polarizability: 2.16835790e+02 -3.95947019e+00 1.50343459e+02 3.36145367e-01 1.62717021e+00 4.85595043e+01
1716.lowfreq: -0.0003 -0.0001 0.0007 7.3832 12.1868 14.7696 61.3867 137.4466 159.7965
frequency: 61.3785 137.4453 159.7963 193.1121 220.8601 238.3372 297.5069 313.6290 341.5309 373.0721 426.8771 448.2874 488.3769 499.8707 523.9868 531.4024 581.2233 631.9191 689.5202 720.0131 742.8874 762.4256 782.2951 828.4633 841.6625 850.3706 898.6743 941.1176 956.3128 970.3568 1054.1728 1073.6454 1108.5890 1136.7984 1168.7481 1181.5874 1231.1084 1265.4110 1308.0556 1346.0648 1372.2365 1381.7710 1421.4239 1460.4345 1484.6133 1520.7166 1544.7572 1565.4432 1634.9071 3130.8228 3167.8222 3171.3318 3186.5768 3195.3121 3213.5662 3376.3347 3576.4148
redmass: 5.7388 4.6325 5.8263 5.9711 3.5805 5.7521 1.5382 2.6915 7.6655 1.8795 1.7862 6.2068 7.2740 3.7721 4.9847 3.3390 6.5651 4.3351 6.0340 1.7438 1.2559 2.3916 5.4708 1.5289 5.5051 6.7562 1.3039 8.0570 1.3753 1.2897 2.3752 1.8003 2.8948 1.8396 1.4994 1.2160 1.4227 1.5467 1.7970 2.3764 2.0092 1.9303 2.7342 3.0198 4.2748 6.7935 6.4929 4.9827 7.6072 1.0883 1.0897 1.0924 1.0918 1.0942 1.0993 1.0676 1.0673
irintensity: 0.5047 6.9330 3.5165 0.6058 3.4335 13.0476 67.6309 49.1984 5.8764 84.8048 54.8674 4.7694 22.1789 4.0808 3.6171 14.3048 2.6338 0.9945 28.3224 3.2675 157.2846 13.9817 0.0046 13.6352 104.3476 68.7705 2.0289 108.6762 3.9989 2.8626 24.4969 14.9244 24.6023 7.3078 0.8186 10.9647 69.2729 9.0312 1.9824 25.5561 55.4774 108.9332 60.8026 34.6391 21.3367 20.3518 203.4007 7.3450 138.7636 25.4027 2.3467 5.0790 4.0136 4.4158 1.4134 7.5584 80.0302
temp: 298.150 k
press: 1.00000 atm
elementType: 8 8 7 7 6 6 6 6 6 6 6 6 6 1 1 1 1 1 1 1 1
symmnumber: 1
zpe: 405123.6 jmol-1
zpe.correction: 0.154303 hartree
zpe.thermalcorrener: 0.165223 hartree
zpe.thermalcorrenthalpy: 0.166167 hartree
zpe.thermalcorrgfe: 0.118046 hartree
zpe.sumelectzpe: -606.660478 hartree
zpe.sumelectthermal: -606.649559 hartree
zpe.sumelectthermalent: -606.648615 hartree
zpe.sumelectthermalfe: -606.696736 hartree
dipole: 3.3421 -0.5821 1.2178
dipole: 3.6043
quadrupole: -66.8482 -63.6683 -79.1579
quadrupole: 1.7047 4.1091 2.3432
quadrupole: 3.0433 6.2231 -9.2664 1.7047 4.1091 2.3432
hfenergy: -606.8147819 hartree
pointgroup: C01 [X(C9H8N2O2)]
dipole: -1.3204104 -0.1740084 -0.4869252 debye
dipolederiv: -0.3403888 0.0866828 -0.1637394 0.1802923 -0.3720838 -0.1263587 -0.1291593 -0.051151 -0.0896244 -1.7304892 0.2161912 0.0012804 -0.5695649 0.0522162 -0.0002174 0.0121702 0.0011291 -0.3877552 -0.0199371 -0.7068718 0.0657633 0.0911977 -0.2292707 0.0359554 0.1806581 -0.0954482 -0.0090449 1.0801192 -0.0674513 -0.0056993 0.7448441 -0.5332248 0.0012704 -0.0126856 -0.0034376 -0.2351237 0.1425815 0.2716863 -0.0120562 -0.5001023 -0.3991081 -0.0016795 -0.0179302 -0.00793 0.0336418 0.1941132 0.3469898 0.0067611 0.8926461 0.8301119 0.0077493 0.0277717 -0.0085199 0.0631624 -0.161206 -0.1577066 -0.0042882 -0.0801976 0.4278227 0.0018482 -0.0117636 0.0002284 0.0425669 0.5061902 0.1308076 0.0033264 0.0799699 0.1882102 -0.0032281 0.0079912 -0.0063498 -0.0917528 -0.529237 -0.1207715 -0.0512983 -0.7364713 -0.612034 0.0230981 -0.012288 0.1103884 -0.3457725 -0.2169898 -0.0056982 -0.0068944 0.5703831 -0.342599 -0.0000794 0.0138904 -0.0041544 -0.1945381 -0.0664578 0.1217211 -0.0142621 -0.8746532 0.4520381 -0.0345912 -0.0323694 0.0013217 -0.0638328 -0.6995215 -0.0840316 -0.0037736 0.3015869 -0.0909655 -0.0004074 -0.0699802 0.0088331 -0.2225879 0.9759413 0.0562981 0.0097151 -0.0126162 0.2178201 0.0047499 -0.027573 0.0121236 -0.1160784 0.0373833 0.0772413 -0.0038457 0.0322898 0.0543264 0.0036923 0.0091221 0.0020961 0.1528386 -0.0309819 0.0965217 0.0070181 0.048165 0.0208786 -0.0185872 0.0199422 -0.0517862 0.2176391 -0.0164314 -0.0627149 0.0021033 0.0102754 0.0799096 0.0002396 0.0072441 -0.0002273 0.1894428 0.0353816 -0.0147242 -0.0071197 -0.0002921 0.108068 0.0008774 0.0268711 -0.0061615 0.1938753 0.049139 -0.0544895 0.0009785 -0.0725993 -0.0356186 0.0085443 0.0088193 0.0136952 0.180626 0.0828007 -0.0523194 0.000097 -0.0793114 -0.1332487 -0.0039867 -0.0112796 -0.0027986 0.1396118 0.3011764 -0.0836 0.1747176 0.0138895 0.2128682 0.1010489 0.0100101 0.0877978 0.1603969 0.4068141 0.006239 0.0012162 -0.0397314 0.1038834 0.0000619 0.0005384 0.0003511 0.3823089 unknown
polarizability: 217.0473502|0.7297374|150.0092539|1.669331|-3.6673253|48.682149 unknown
InChI: InChI=1S/C9H8N2O2/c12-10-8-4-1-5-9-7(8)3-2-6-11(9)13/h1-6,12-13H
charge 0 multiplicity 1
21 atoms
O  -3.162099 1.226421 -0.117988
O  3.83852 -0.70142 -0.032718
N  -2.156181 0.201285 -0.058698
N  2.45482 -1.206685 -0.020609
C  0.157502 -0.512515 0.002267
C  -0.801894 0.594186 -0.00826
C  1.598248 -0.16506 -0.015401
C  -0.311338 -1.834718 0.041781
C  -0.415349 1.937236 0.002266
C  1.967055 1.241667 -0.024433
C  -2.626736 -1.089354 -0.018168
C  -1.709217 -2.132104 0.048435
C  0.993139 2.229477 -0.009059
H  0.426101 -2.641422 0.068168
H  -1.143042 2.747735 0.089094
H  3.029647 1.490996 -0.03427
H  -3.711418 -1.200273 -0.043689
H  -2.072103 -3.160906 0.091811
H  1.299011 3.282432 0.002886
H  -2.886972 1.814689 -0.882543
H  4.358605 -1.544667 -0.035371
