program: Gaussian 09
title: 000146480
version: EM64L-G09RevD.01
frameworkgroup: C1[X(C5H12N2OS)]
method: RPBEPBE
basis: SDD
operation: Freq
keyword: #p
keyword: freq=noraman
keyword: PBEPBE/SDD
title: #p freq=noraman PBEPBE/SDD
converged: YES YES NO NO
title: Mulliken charges:
elementType: S O N N C C C C C H H H H H H H H H H H H
charge: 0.169501 -0.256849 -0.546890 -0.612822 -0.344636 -0.230978 -0.689450 0.196006 -0.843581 0.235051 0.247674 0.209356 0.236051 0.271163 0.285984 0.268083 0.332839 0.312531 0.250754 0.255650 0.254562
chargesum: 0.00000
title: Mulliken charges with hydrogens summed into heavy atoms:
elementType: S O N N C C C C C
charge: 0.169501 -0.256849 0.007176 0.032548 0.138090 -0.021622 -0.182236 0.196006 -0.082615
polarizability: 1.04926284e+02 -5.63349099e+00 8.76854264e+01 -7.69608177e-01 -5.90839072e+00 7.26155404e+01
1716.lowfreq: -0.0038 -0.0020 -0.0018 5.5037 6.3140 10.5505 33.9159 38.5699 63.5691
frequency: 33.7321 38.3900 63.4855 92.2370 121.7551 161.1681 188.2493 217.2963 238.2884 287.3164 315.5517 362.7261 481.7311 506.4124 603.7859 608.3514 663.8597 702.8044 720.8114 723.0582 767.4716 811.7567 959.2988 964.5514 987.5143 1011.6337 1049.0262 1062.3183 1099.3920 1128.2193 1196.6792 1245.9991 1254.8580 1282.1977 1330.5132 1333.7214 1349.0320 1369.6083 1449.6756 1453.3569 1462.1679 1466.9852 1594.0664 1639.9396 1649.7207 2986.9788 2989.1376 2998.3480 3004.1351 3054.4666 3080.5890 3108.7500 3127.8590 3419.6059 3507.3565 3542.2560 3663.5705
redmass: 4.6171 4.1776 3.6542 2.6719 2.8479 1.0863 3.3342 2.0515 2.6553 1.7008 3.7883 3.4710 3.0186 1.1443 1.4045 2.4602 6.4837 3.6535 2.3828 1.8475 3.1165 1.3962 1.3632 1.3564 1.3737 1.7944 1.9251 3.0642 1.3422 2.2447 1.4173 1.5101 1.2978 1.2685 1.7324 1.3554 1.1878 1.6417 1.0553 1.0857 1.0547 1.0910 1.4764 3.2530 1.0883 1.0761 1.0648 1.0299 1.0603 1.1039 1.1058 1.1056 1.1021 1.0451 1.0447 1.0957 1.1038
irintensity: 8.6887 5.4897 0.3607 0.6062 0.9690 0.2956 0.7802 21.3302 23.0124 42.7141 8.3636 5.3495 9.0274 169.3411 121.0441 34.7327 1.5995 40.9370 105.2957 69.0271 29.2217 22.7715 4.7192 17.0055 6.5277 2.8684 0.7789 1.6496 12.8667 6.9433 5.1403 64.8998 2.1532 16.2933 28.0506 14.7665 1.7985 17.5405 14.3534 8.6922 10.3974 12.0803 52.6210 247.2874 44.9405 10.5969 38.7862 40.7562 30.1672 2.1961 40.1194 23.7152 12.2154 1.6710 23.9694 2.7054 19.0437
temp: 298.150 k
press: 1.00000 atm
elementType: 16 8 7 7 6 6 6 6 6 1 1 1 1 1 1 1 1 1 1 1 1
symmnumber: 1
zpe: 457773.6 jmol-1
zpe.correction: 0.174357 hartree
zpe.thermalcorrener: 0.186368 hartree
zpe.thermalcorrenthalpy: 0.187312 hartree
zpe.thermalcorrgfe: 0.134714 hartree
zpe.sumelectzpe: -779.781448 hartree
zpe.sumelectthermal: -779.769437 hartree
zpe.sumelectthermalent: -779.768493 hartree
zpe.sumelectthermalfe: -779.821090 hartree
dipole: 0.4059 3.3894 -3.7404
dipole: 5.0639
quadrupole: -60.6747 -60.5732 -65.0307
quadrupole: -2.9661 -6.4946 -6.0189
quadrupole: 1.4182 1.5197 -2.9378 -2.9661 -6.4946 -6.0189
hfenergy: -779.9558043 hartree
pointgroup: C01 [X(C5H12N2O1S1)]
dipole: 0.2835637 -0.964842 1.7198717 debye
dipolederiv: -0.224391 -0.0625368 0.035846 -0.0366278 -0.0688774 -0.0753791 0.0227917 -0.089998 -0.1289612 -0.4518959 0.0797515 0.1589262 0.1412946 -0.5991088 -0.130996 0.137243 0.0284178 -0.9451103 -0.4740202 -0.006416 0.0889972 -0.1083639 -0.8398473 -0.0013729 0.0734284 -0.011814 -0.2317338 -0.6999715 0.0198779 -0.167328 -0.058311 -0.6568366 0.4986656 -0.0958462 0.3134061 -0.7026484 -0.0735483 -0.0946675 0.003744 0.1279536 0.0373673 0.0338209 -0.1053219 -0.0374965 0.0773561 0.3499447 0.1902556 -0.0469773 0.1135171 0.2770537 -0.0193133 -0.0009627 -0.0518712 0.2303367 0.3099763 -0.0594193 0.0553421 -0.0445773 0.0113227 0.0754909 0.0623327 0.0722174 0.1465639 0.2537701 -0.2570438 -0.0947342 -0.3572888 0.8663993 -0.2939156 -0.1928657 -0.3069574 1.2957479 -0.002061 0.0938944 -0.0636784 0.0787314 0.1031141 -0.0055285 -0.0590566 0.0067111 0.0719292 0.0692971 -0.0094306 0.0169754 -0.0170413 0.0786558 -0.0093224 0.0128186 0.0160603 -0.0971094 0.0494898 0.0881366 0.0083909 0.0433979 -0.0756754 -0.0433384 0.013441 -0.0198635 0.0758765 0.045273 -0.0035604 0.001763 0.0034595 0.0029118 0.0260218 -0.001245 0.0012889 -0.1945696 -0.0496166 0.0018891 -0.0525196 0.0151964 0.0627269 0.0265511 -0.0562263 0.0297635 -0.173385 -0.0263369 0.043314 -0.0107403 0.0663934 -0.120707 -0.0321586 -0.0123185 -0.0418485 0.0460955 0.1997325 -0.0749796 0.021723 -0.0347743 0.3225321 -0.1222075 0.0240987 -0.0204036 0.059923 -0.0402604 -0.048413 -0.0626201 0.0794491 0.3055803 0.0868105 -0.0131033 0.0887609 0.1610529 0.3747609 0.0634941 0.0375916 0.0658269 0.1447019 -0.0060664 0.0417782 0.0120242 0.1682539 0.3734421 0.0256268 0.0739418 0.038204 0.1920026 -0.03236 0.0788529 -0.0303033 0.139891 0.0852088 -0.0330847 -0.0262931 -0.0746971 0.0202016 0.0501494 0.0421729 0.0583592 -0.1607558 0.0625994 0.0559068 0.0559174 -0.0221115 -0.1565296 -0.0466537 0.0614802 -0.036477 0.0499667 -0.1313927 -0.012595 -0.0342677 -0.0196311 0.0930118 0.0211021 -0.0334919 0.0200238 0.11128 unknown
polarizability: 104.4094315|5.9021252|84.7759416|-1.701519|-8.9340268|76.0418779 unknown
InChI: InChI=1S/C5H12N2OS/c1-9-3-2-4(6)5(7)8/h4H,2-3,6-7H2,1H3
charge 0 multiplicity 1
21 atoms
S  -2.945585 0.509505 -0.225384
O  2.059951 -0.836802 -1.325507
N  2.115144 1.898233 -0.231777
N  1.858251 -1.529611 0.882883
C  -0.19595 1.045511 -0.204437
C  1.253716 0.826842 0.30637
C  -1.206813 0.032614 0.358145
C  1.755242 -0.581047 -0.122029
C  -3.889102 -0.963018 0.469508
H  -0.190475 0.987083 -1.310133
H  -0.4831 2.075302 0.075894
H  1.258339 0.907356 1.411992
H  -1.206861 0.036532 1.464659
H  -0.998508 -0.990313 -0.001697
H  2.196547 1.823571 -1.255112
H  3.047149 1.922397 0.200163
H  2.181352 -2.46852 0.645908
H  1.617294 -1.318649 1.849784
H  -3.793706 -1.001353 1.567056
H  -3.522333 -1.900496 0.020684
H  -4.946454 -0.816134 0.199029
