program: Gaussian 09
title: 000146486
version: EM64L-G09RevD.01
frameworkgroup: C1[X(C13H14N2)]
method: RPBEPBE
basis: SDD
operation: Freq
keyword: #pfreq=noraman
keyword: PBEPBE/SDD
title: #p freq=noraman PBEPBE/SDD
converged: YES YES NO NO
title: Mulliken charges:
elementType: N N C C C C C C C C C C C C C H H H H H H H H H H H H H H
charge: -0.710104 -0.710108 -0.717773 0.560918 0.560986 -0.566090 -0.566168 -0.514082 -0.514056 0.504515 0.504540 -0.189823 -0.189815 -0.448089 -0.448114 0.221432 0.221479 0.233183 0.233193 0.230539 0.230530 0.215303 0.215301 0.213960 0.213970 0.305864 0.301324 0.305865 0.301320
chargesum: 0.00000
title: Mulliken charges with hydrogens summed into heavy atoms:
elementType: N N C C C C C C C C C C C C C
charge: -0.102916 -0.102922 -0.274862 0.560918 0.560986 -0.332907 -0.332976 -0.283543 -0.283526 0.504515 0.504540 0.025479 0.025486 -0.234129 -0.234144
polarizability: 1.84479732e+02 -1.52485979e-02 1.40820204e+02 2.01631608e+01 -2.76064019e-03 1.32804285e+02
1716.lowfreq: -18.1758 -8.9765 -7.3862 -0.0004 0.0004 0.0007 20.0119 20.4569 51.4098
frequency: 19.9614 20.2073 51.3891 177.6449 190.6833 216.5494 218.7713 276.0147 279.7369 335.2448 346.4777 375.3639 377.4650 388.9403 406.5664 440.4447 444.3852 524.5937 527.4567 535.8783 557.3238 575.7844 647.3739 697.4599 698.2744 735.7665 755.8422 779.8961 795.4472 856.1449 868.6258 873.7567 884.8913 929.0676 943.7181 958.8562 960.7627 968.7131 983.2209 983.2777 1038.4011 1040.1652 1094.0137 1102.6302 1165.2591 1178.0111 1178.1372 1187.8534 1191.3914 1274.3010 1313.2878 1326.8461 1327.1929 1340.8194 1390.6726 1393.5787 1452.0997 1463.1769 1476.0595 1490.6019 1491.1349 1591.6927 1597.0116 1624.8149 1629.1457 1641.5296 1643.4968 2969.4088 3014.6473 3111.5215 3111.6020 3114.0878 3114.2610 3127.0275 3127.0577 3149.2164 3149.4776 3568.5010 3568.5899 3709.7338 3709.7531
redmass: 4.2512 3.8652 4.9917 4.2816 4.3526 3.4236 3.4926 4.9481 2.1598 1.2427 1.2165 1.0431 1.0751 2.7209 2.4510 2.9198 2.6871 4.9552 6.1427 4.9997 4.8754 3.8579 5.1247 2.1229 1.8706 2.8377 5.2181 1.5324 1.7476 1.3374 1.4601 1.5755 1.6628 2.4727 2.7708 1.4129 1.3355 1.8605 5.9052 5.7122 1.5769 1.5607 1.6434 1.4920 1.7364 1.0964 1.0785 1.1280 1.6862 1.3744 1.6619 1.8685 1.6886 2.2255 7.0266 7.7455 1.3723 3.1395 2.0035 2.8331 2.8774 6.2034 6.2022 4.6520 3.4563 1.2362 1.3646 1.0596 1.1000 1.0875 1.0874 1.0888 1.0892 1.0913 1.0912 1.0993 1.0993 1.0448 1.0448 1.1040 1.1040
irintensity: 0.2564 1.1259 0.3504 8.3908 3.2372 5.6321 4.2793 0.4279 3.8305 342.6864 225.5381 7.4006 18.2880 0.4249 3.7910 1.8621 6.1603 0.7206 0.3002 1.9159 2.5610 0.1834 0.9368 15.4449 29.9345 37.0006 8.8599 67.5644 19.7792 6.8154 0.7113 26.2126 11.2048 1.2544 9.5444 0.0762 1.1437 8.6226 6.8279 6.0289 3.9509 6.4526 0.0116 25.7920 0.2710 4.0575 8.7864 18.3192 4.4097 13.4499 15.3221 24.0275 22.5243 12.4831 20.7845 0.2891 0.1289 27.3000 52.2073 42.8348 41.9946 57.0625 2.6038 118.9292 53.8701 202.8542 266.8250 30.2703 14.7878 0.3495 5.3864 12.1139 26.7738 37.0076 23.1988 54.8530 3.4857 49.9441 57.7188 7.2990 28.5263
temp: 298.150 k
press: 1.00000 atm
elementType: 7 7 6 6 6 6 6 6 6 6 6 6 6 6 6 1 1 1 1 1 1 1 1 1 1 1 1 1 1
symmnumber: 1
zpe: 626820.4 jmol-1
zpe.correction: 0.238743 hartree
zpe.thermalcorrener: 0.252461 hartree
zpe.thermalcorrenthalpy: 0.253406 hartree
zpe.thermalcorrgfe: 0.196936 hartree
zpe.sumelectzpe: -612.234602 hartree
zpe.sumelectthermal: -612.220884 hartree
zpe.sumelectthermalent: -612.219940 hartree
zpe.sumelectthermalfe: -612.276409 hartree
dipole: -0.0008 2.9576 0.0011
dipole: 2.9576
quadrupole: -78.4538 -79.8560 -81.3502
quadrupole: -0.0014 -2.6232 -0.0009
quadrupole: 1.4328 0.0307 -1.4635 -0.0014 -2.6232 -0.0009
hfenergy: -612.4733452 hartree
pointgroup: C01 [X(C13H14N2)]
dipole: -0.0036128 0.0000771 -1.1636204 debye
polarizability: 175.9596985|27.8249096|141.3240904|-0.0903297|-0.0723349|140.8204323 unknown
InChI: InChI=1S/C13H14N2/c14-12-5-1-3-10(8-12)7-11-4-2-6-13(15)9-11/h1-6,8-9H,7,14-15H2
charge 0 multiplicity 1
29 atoms
N  -3.271772 1.003235 -1.873646
N  3.259524 -1.003133 -1.892919
C  0.00467 0.000139 1.769743
C  -1.240477 -0.365562 0.960942
C  1.245201 0.365407 0.953848
C  -1.674045 0.466751 -0.09605
C  1.672339 -0.466625 -0.105961
C  -1.995041 -1.520462 1.289697
C  2.00216 1.519869 1.278675
C  -2.855091 0.169556 -0.831157
C  2.849288 -0.16962 -0.847733
C  -3.171258 -1.82168 0.563919
C  3.174214 1.820957 0.546221
C  -3.607384 -0.991948 -0.486982
C  3.603975 0.991473 -0.507526
H  -0.234822 0.851654 2.438031
H  0.247596 -0.850907 2.437383
H  -1.080123 1.351632 -0.359965
H  1.076573 -1.351162 -0.366848
H  -1.665343 -2.174648 2.105107
H  1.677392 2.17387 2.09621
H  -3.754405 -2.714619 0.818744
H  3.75914 2.713614 0.797942
H  -4.520831 -1.23618 -1.043761
H  4.514242 1.235634 -1.069516
H  -2.736185 1.828659 -2.124283
H  -4.118979 0.801012 -2.395246
H  2.722248 -1.828374 -2.140515
H  4.103792 -0.801144 -2.419354
