program: Gaussian 09
title: 000146599
version: EM64L-G09RevD.01
frameworkgroup: C1[X(C22H25NO5)]
method: RPBEPBE
basis: SDD
operation: Freq
keyword: #p
keyword: freq=noraman
keyword: PBEPBE/SDD
title: #p freq=noraman PBEPBE/SDD
converged: YES YES NO NO
title: Mulliken charges:
elementType: O O O O O N C C C C C C C C C C C C C C C C C C C C C C H H H H H H H H H H H H H H H H H H H H H H H H H
charge: -0.287685 -0.268235 -0.265566 -0.429710 -0.291018 -0.145151 0.357524 -0.512638 -0.310896 -0.370404 -0.371588 -0.466696 -0.460272 -0.797555 0.289513 0.167261 0.410896 -0.493249 -0.527467 0.155659 -0.088462 0.206308 -0.382051 0.193896 -0.244015 -0.207050 -0.359614 -0.520074 0.262752 0.245341 0.188732 0.233166 0.216430 0.227996 0.215403 0.228017 0.222830 0.222748 0.219558 0.257803 0.226048 0.246459 0.277670 0.270584 0.262746 0.227082 0.227348 0.239339 0.252946 0.349588 0.260283 0.208870 0.228601
chargesum: 0.00000
title: Mulliken charges with hydrogens summed into heavy atoms:
elementType: O O O O O N C C C C C C C C C C C C C C C C C C C C C C
charge: -0.287685 -0.268235 -0.265566 -0.080122 -0.291018 -0.145151 0.357524 -0.004545 -0.122164 0.079192 0.071811 -0.015849 -0.017966 -0.067245 0.289513 0.167261 0.410896 -0.215579 -0.256883 0.155659 -0.088462 0.206308 -0.119304 0.193896 -0.016933 0.259636 -0.106669 0.177680
polarizability: 3.00666777e+02 8.22284123e+00 2.97701728e+02 4.00497717e-01 1.54952683e+01 2.02862764e+02
1716.lowfreq: -6.7814 -0.9090 -0.0005 -0.0003 -0.0001 5.2307 13.4270 32.7166 43.2746
frequency: 13.2965 32.6478 43.2512 45.8153 53.2450 71.3193 75.1107 96.9735 101.7017 109.1290 123.0668 143.7226 164.5968 171.0628 188.4181 196.9318 231.9207 239.3185 244.1464 259.2070 266.3862 280.4298 294.1283 310.1691 330.6866 334.1141 349.5651 360.7809 362.9145 397.3787 418.9527 438.2873 447.8749 487.8687 499.1622 531.7242 546.4969 554.2263 565.6013 574.3596 593.7628 611.1336 626.4487 644.5061 673.6826 680.8506 704.5111 726.3182 737.1382 744.9402 758.5834 779.4073 797.9573 808.2560 817.3246 837.0066 848.7566 849.9025 874.9402 879.3879 891.5550 901.9676 911.4952 918.2985 928.1113 935.0624 967.3404 971.8427 978.8468 987.7483 1002.3921 1023.5752 1045.9070 1065.5821 1070.8315 1073.6619 1085.0035 1111.3312 1115.3596 1123.8446 1131.6524 1136.2266 1146.9261 1152.1344 1157.9337 1160.7311 1166.6549 1174.8477 1196.3135 1200.8885 1222.4175 1228.5036 1238.1287 1250.6432 1260.9315 1265.7590 1267.5609 1284.4813 1298.8316 1304.7941 1315.0882 1315.2577 1339.0641 1345.5091 1359.0006 1362.6137 1389.8342 1392.8775 1400.8348 1412.4573 1427.2033 1443.8983 1454.0919 1457.7608 1465.2984 1466.2012 1467.4596 1468.3820 1472.7570 1481.7269 1484.4571 1486.7502 1493.5461 1501.2964 1593.1521 1607.7699 1617.7435 1628.8562 2862.3375 2936.3293 2969.8871 2972.9960 2988.4204 2998.4633 3007.1873 3008.8994 3009.2944 3024.3291 3040.4487 3074.0722 3074.6192 3081.9355 3089.0077 3095.8747 3109.6056 3110.6720 3125.2910 3134.5333 3152.5689 3164.7994 3172.0545 3190.3877 3547.4276
redmass: 4.8303 3.7911 4.2615 4.7198 4.1617 2.8328 2.3921 3.4933 2.5448 3.1331 3.3668 1.7818 3.4826 4.1973 2.8503 3.4811 2.9992 2.8440 1.8700 3.0479 3.3145 4.2566 4.2922 3.1069 1.5793 2.0421 3.7018 4.5055 4.2649 4.3770 4.1064 4.5751 4.2306 4.1922 3.4216 4.9205 4.4546 5.3107 5.5523 2.0778 6.7557 4.4126 4.4865 9.3897 7.0885 6.1035 4.0935 4.3483 3.0732 3.5769 3.9934 3.0305 1.9774 5.6112 4.1281 4.9006 1.7171 1.6756 1.7606 1.4603 3.1205 1.8564 1.8722 2.4261 2.0871 1.6367 1.3250 5.6438 4.8159 1.6583 2.4504 2.3033 1.9199 2.5524 1.9476 1.5087 2.0207 1.2386 1.8302 2.0001 1.2682 1.7650 2.2573 1.4144 1.6881 1.4284 1.5848 1.5429 2.4233 2.0051 1.4031 1.2769 1.4419 2.1428 3.8244 2.2455 1.7277 1.8414 1.8957 1.3614 1.5327 1.3013 1.5513 1.4023 1.3198 1.8938 2.1196 1.7714 5.4233 5.9435 1.1961 2.5883 1.1540 1.1523 1.7397 1.1609 1.8976 1.3708 1.0980 1.0623 1.3368 1.0782 1.0762 1.0867 6.4305 7.0135 9.9990 8.1800 1.0793 1.0675 1.0579 1.0350 1.0630 1.0379 1.0690 1.0640 1.0628 1.0967 1.0936 1.1007 1.1013 1.0967 1.1057 1.0982 1.0986 1.1077 1.1046 1.0863 1.0925 1.0924 1.0983 1.0930 1.0652
irintensity: 0.2543 0.1813 0.8676 0.4685 1.0070 0.4408 5.8413 1.4118 14.3020 1.1701 4.6367 0.3807 11.6503 3.0942 1.2940 1.0280 0.5415 2.0595 0.9811 2.7047 3.7560 2.6772 3.0337 10.0433 45.3977 23.3415 1.1449 7.3537 3.9335 4.4356 41.0709 11.8367 5.5233 41.5399 11.6438 3.2556 13.2922 11.8388 11.0061 2.7376 92.2294 26.2135 16.9683 14.8893 2.7842 4.5966 2.0736 1.2041 6.4919 69.1590 3.1330 23.9138 34.1769 34.0431 124.3323 26.5934 23.8088 1.2667 3.3044 20.9629 25.3417 5.6271 11.5626 2.2341 16.1499 0.9934 2.1026 148.6798 60.9131 3.5641 22.0444 65.3999 61.2705 82.1812 29.9340 9.0806 18.6862 6.0200 27.0041 138.2119 16.1199 90.7912 146.2309 6.0058 19.4163 3.6388 2.8656 20.4528 215.7006 7.2627 5.5507 18.6554 8.5827 139.3172 30.0170 19.8150 4.7719 38.1756 137.0522 8.4868 24.1603 8.0655 3.3870 1.7193 8.2753 140.6587 37.4587 18.9665 75.5417 7.7635 3.0810 87.7175 5.6417 8.5331 178.3536 7.0090 60.2582 25.7609 9.0385 18.3597 32.3726 8.0643 10.6615 2.6837 14.1550 12.8200 27.0942 22.1932 64.1830 59.0062 41.1338 89.9330 155.0667 12.8949 17.8327 17.4856 35.9631 31.3022 47.1784 11.6518 36.2308 36.2244 56.8948 23.1907 22.3555 31.8981 20.1614 4.5900 10.8172 2.3382 12.5260 0.3892 33.9952
temp: 298.150 k
press: 1.00000 atm
elementType: 8 8 8 8 8 7 6 6 6 6 6 6 6 6 6 6 6 6 6 6 6 6 6 6 6 6 6 6 1 1 1 1 1 1 1 1 1 1 1 1 1 1 1 1 1 1 1 1 1 1 1 1 1
symmnumber: 1
zpe: 1123887.1 jmol-1
zpe.correction: 0.428066 hartree
zpe.thermalcorrener: 0.453997 hartree
zpe.thermalcorrenthalpy: 0.454941 hartree
zpe.thermalcorrgfe: 0.371124 hartree
zpe.sumelectzpe: -1282.083996 hartree
zpe.sumelectthermal: -1282.058065 hartree
zpe.sumelectthermalent: -1282.057121 hartree
zpe.sumelectthermalfe: -1282.140938 hartree
dipole: 2.2568 -0.4795 -1.9493
dipole: 3.0204
quadrupole: -164.3890 -159.2319 -155.5703
quadrupole: -13.2314 3.7054 0.6067
quadrupole: -4.6586 0.4985 4.1601 -13.2314 3.7054 0.6067
hfenergy: -1282.5120623 hartree
pointgroup: C01 [X(C22H25N1O5)]
dipole: 0.8911058 -0.0385061 0.7851963 debye
polarizability: 298.1189173|-8.9761502|295.0608731|2.6224629|26.4552993|208.0514781 unknown
InChI: InChI=1S/C22H25NO5/c1-22(23-8-3-4-9-23)12-16(14-6-5-7-17(25-2)21(14)24)15-10-19-20(27-13-26-19)11-18(15)28-22/h5-7,10-11,16,24H,3-4,8-9,12-13H2,1-2H3
charge 0 multiplicity 1
53 atoms
O  2.430488 -0.36263 0.019276
O  -0.991865 -4.751304 -0.536082
O  1.363333 -5.064477 -0.865479
O  -2.598872 1.856029 1.684994
O  -4.889966 2.681818 0.207946
N  2.963441 1.965204 0.385177
C  1.993876 0.983056 0.737263
C  0.596852 1.324015 0.177017
C  -0.469465 0.221166 0.436816
C  3.081308 2.392456 -1.047654
C  4.308706 1.968537 1.028553
C  4.581095 2.739867 -1.240093
C  5.087527 3.008838 0.199099
C  1.992336 0.661263 2.241018
C  0.072729 -1.166181 0.081898
C  1.472168 -1.376902 -0.095987
C  -1.761541 0.608654 -0.296691
C  -0.821255 -2.274809 -0.025285
C  1.999133 -2.66565 -0.41637
C  -0.293213 -3.526091 -0.323351
C  -2.74271 1.410136 0.350719
C  1.092458 -3.714135 -0.522931
C  -1.946312 0.282838 -1.663582
C  -3.909568 1.840206 -0.346942
C  -3.082408 0.729278 -2.368217
C  0.075914 -5.77562 -0.632319
C  -4.063613 1.499635 -1.707953
C  -5.476169 2.300171 1.509392
H  0.67588 1.468645 -0.914381
H  0.263204 2.285801 0.60849
H  -0.674601 0.196318 1.535103
H  2.774673 1.576378 -1.729678
H  2.435945 3.271089 -1.240882
H  4.237855 2.255483 2.092501
H  4.799883 0.97254 0.964928
H  4.728866 3.598821 -1.916289
H  5.117166 1.872575 -1.666802
H  6.179987 2.893623 0.30213
H  4.812219 4.029907 0.521376
H  2.99176 0.336083 2.570288
H  1.696266 1.550993 2.825805
H  1.294544 -0.163075 2.460186
H  -1.898074 -2.13014 0.098728
H  3.073982 -2.795094 -0.556851
H  -1.193004 -0.334521 -2.164297
H  -3.21177 0.471244 -3.42429
H  0.142513 -6.325734 0.326701
H  -0.130213 -6.430697 -1.492063
H  -4.960527 1.856788 -2.223224
H  -1.779757 1.472341 2.087973
H  -4.716474 2.315317 2.307265
H  -5.937244 1.295158 1.44471
H  -6.254288 3.05539 1.698842
