program: Gaussian 09
title: 000146569
version: EM64L-G09RevD.01
frameworkgroup: C1[X(C22H25N3O)]
method: RPBEPBE
basis: SDD
operation: Freq
keyword: #p
keyword: freq=noraman
keyword: PBEPBE/SDD
title: #p freq=noraman PBEPBE/SDD
converged: YES YES NO NO
title: Mulliken charges:
elementType: O N N N C C C C C C C C C C C C C C C C C C C C C C H H H H H H H H H H H H H H H H H H H H H H H H H
charge: -0.272880 -0.473474 -0.373990 -0.059614 0.024163 -0.036730 0.163205 0.028358 0.181971 0.171487 0.397039 0.207379 -0.023135 -0.905155 -0.478184 -0.839159 -0.394673 -0.375533 -0.031943 -0.389381 0.292102 -0.393520 -0.353645 -0.715516 -0.706247 -0.538758 0.297722 0.270244 0.219109 0.257052 0.256680 0.247074 0.199098 0.243191 0.243673 0.205858 0.247748 0.238485 0.326578 0.229748 0.227023 0.240483 0.196590 0.220009 0.218789 0.198202 0.214118 0.221593 0.242605 0.217229 0.216930
chargesum: 0.00000
title: Mulliken charges with hydrogens summed into heavy atoms:
elementType: O N N N C C C C C C C C C C C C C C C C C C C C C C
charge: -0.272880 -0.175752 -0.047412 -0.059614 0.024163 -0.036730 0.163205 0.028358 0.181971 0.171487 0.397039 0.207379 -0.023135 -0.158750 -0.221504 -0.146438 0.051500 -0.137048 0.215805 -0.159633 0.292102 -0.166497 -0.113162 -0.080127 -0.072334 0.138006
polarizability: 4.69438594e+02 2.56503537e+01 3.08725886e+02 -2.57854346e+01 1.65000412e+01 1.47866987e+02
1716.lowfreq: -3.3422 -0.0005 -0.0002 0.0006 5.1069 10.3098 28.2547 35.0226 48.0568
frequency: 28.2432 34.8533 48.0387 56.4705 71.3812 75.2810 91.3809 105.7211 124.1862 136.7687 169.8974 179.3424 196.0201 206.3045 218.4354 225.9892 235.6270 255.5796 265.5551 267.0064 272.6548 282.9417 309.6971 341.1770 349.6306 358.0934 369.1269 392.9307 403.0724 410.2118 434.0580 439.6713 457.4296 471.3724 484.4263 511.7646 516.2252 533.3300 562.8160 592.7405 601.4042 611.7835 633.1969 647.3175 663.8202 682.3686 731.8166 735.2518 766.4149 784.8384 789.2903 795.3546 810.6395 821.8574 826.3951 853.2321 879.2676 884.9767 907.6191 917.1490 929.4403 940.1582 943.3614 959.2838 964.4283 1010.6641 1017.8417 1032.8930 1038.3118 1046.2058 1071.4078 1099.6100 1112.6734 1113.7903 1124.2689 1133.3689 1138.2025 1159.6516 1163.9387 1176.1449 1189.4415 1215.4688 1246.4212 1261.2770 1272.1727 1294.5191 1307.2098 1310.6917 1315.4604 1336.4895 1338.0868 1344.2871 1361.5580 1374.0845 1392.4023 1392.7731 1397.2021 1406.6888 1412.9027 1421.0063 1423.7554 1439.0751 1443.6233 1461.7840 1466.5932 1466.8708 1467.5107 1471.7601 1473.0476 1479.8871 1481.6885 1482.0135 1486.4695 1490.1353 1491.0211 1508.5065 1521.0793 1559.7142 1585.5471 1588.1233 1636.7742 1642.6372 2950.6440 2951.6094 2961.5454 2966.2484 2972.0107 2978.2635 3008.2629 3035.8591 3046.2853 3053.0044 3057.8173 3062.5038 3066.9655 3072.3486 3072.9567 3075.7069 3101.2434 3119.2712 3125.1311 3136.1949 3168.2710 3173.0809 3187.2809 3607.2331 3621.5088
redmass: 3.5320 4.1526 3.0521 3.2878 3.5805 2.9545 3.6199 2.9592 1.5335 2.7882 3.4509 4.1720 3.3608 1.2571 1.7000 1.6337 1.9936 1.3639 3.5097 1.9445 2.1855 2.8142 3.2182 3.0349 3.0304 2.7674 3.3401 3.7861 5.8122 1.9520 3.9546 2.8296 1.2909 4.6186 5.4617 1.3753 2.8830 3.8210 4.9486 4.4349 4.6461 3.9457 4.6155 4.6195 4.5900 3.8695 5.2301 5.4758 4.3021 3.4936 1.6339 2.0331 2.6296 3.4913 3.8371 3.3741 1.5892 2.0635 1.3552 1.2340 2.9491 1.6996 1.4210 2.1378 1.8710 3.7124 3.9669 1.5052 1.5756 1.7156 2.9695 2.4534 2.2639 1.2588 2.5538 1.6155 2.3780 1.8099 1.5469 1.7896 2.5631 2.1061 1.5684 2.0290 2.2482 4.1963 1.7414 1.6996 1.6225 2.2200 1.5343 4.9947 1.4091 1.2334 1.2389 1.7045 1.4956 1.9508 4.6158 2.0450 1.8931 1.3604 1.2905 2.8701 1.0453 1.0503 1.0597 1.8622 1.1190 1.2316 1.4219 1.1010 1.3505 1.0591 1.7519 1.0918 2.8289 5.9440 6.9583 6.2936 6.7573 8.3745 1.0498 1.0333 1.0366 1.0368 1.0375 1.0653 1.0828 1.1036 1.0978 1.0984 1.0832 1.0969 1.0993 1.0970 1.0992 1.0985 1.0987 1.0987 1.0890 1.0892 1.0940 1.0948 1.0912 1.0771 1.0795
irintensity: 0.1350 1.1767 0.0869 1.0358 0.1686 3.7763 3.1543 1.4105 1.1165 4.6153 2.9204 1.6132 0.3332 0.2930 1.9673 2.0441 3.4535 0.2007 0.3969 0.4817 0.9342 0.8272 0.2534 4.8400 11.2513 1.7930 5.8338 0.5116 0.2653 1.2323 0.8610 0.5119 93.6884 3.3860 5.6992 101.6787 6.3411 8.1971 6.2393 12.0147 0.5085 1.6175 0.9639 3.6251 8.9960 14.4555 19.7619 2.4667 0.9448 14.8340 30.5568 46.1418 6.3638 13.0870 10.3081 8.3246 22.1156 6.6759 1.8011 7.3874 0.6606 3.4058 2.7794 3.9827 9.2114 77.0132 1.2077 1.9636 0.2836 9.0788 39.6535 12.4869 5.6002 0.1828 16.9414 23.6846 3.5867 2.6991 7.9877 29.7252 208.0628 38.4375 3.8280 4.4328 60.0779 2.8875 9.2387 48.5062 111.5159 47.1887 56.3735 37.3348 8.9780 18.7983 45.3875 10.8357 2.9891 2.8703 3.0255 53.9065 54.1559 15.0984 10.1782 52.1989 12.7044 11.9182 7.1368 172.6412 40.8834 27.4359 16.5116 14.0950 44.4706 13.7824 38.9624 27.8459 412.2560 29.5718 198.3898 107.0129 52.1065 56.4104 24.8415 104.9082 32.0988 39.8628 52.5155 66.5262 10.3921 54.2595 17.6954 16.0038 17.1743 62.7790 30.5488 27.8560 59.1350 27.2874 4.3735 29.4745 27.9487 11.6635 17.7156 30.8277 3.0267 23.4423 43.3263
temp: 298.150 k
press: 1.00000 atm
elementType: 8 7 7 7 6 6 6 6 6 6 6 6 6 6 6 6 6 6 6 6 6 6 6 6 6 6 1 1 1 1 1 1 1 1 1 1 1 1 1 1 1 1 1 1 1 1 1 1 1 1 1
symmnumber: 1
zpe: 1107945.9 jmol-1
zpe.correction: 0.421994 hartree
zpe.thermalcorrener: 0.446650 hartree
zpe.thermalcorrenthalpy: 0.447594 hartree
zpe.thermalcorrgfe: 0.368253 hartree
zpe.sumelectzpe: -1090.972666 hartree
zpe.sumelectthermal: -1090.948011 hartree
zpe.sumelectthermalent: -1090.947066 hartree
zpe.sumelectthermalfe: -1091.026407 hartree
dipole: -3.8936 0.3569 1.3599
dipole: 4.1396
quadrupole: -134.0744 -135.1769 -160.4246
quadrupole: -6.8752 -2.1401 5.0131
quadrupole: 9.1509 8.0484 -17.1993 -6.8752 -2.1401 5.0131
hfenergy: -1091.3946606 hartree
pointgroup: C01 [X(C22H25N3O1)]
dipole: -1.5233762 0.147656 0.5567986 debye
polarizability: 468.4337156|25.6503233|309.3558658|-31.405792|13.109025|148.241885 unknown
InChI: InChI=1S/C22H25N3O/c1-12(2)11-24-22-20-14(4)19-17-10-15(26-5)6-7-18(17)25-21(19)13(3)16(20)8-9-23-22/h6-10,12,24-25H,11H2,1-5H3
charge 0 multiplicity 1
51 atoms
O  -4.933989 -2.83748 -0.137783
N  -2.423976 2.117061 0.486584
N  2.983599 -1.332755 -0.567951
N  3.819154 0.820198 -0.80977
C  -1.053559 0.373253 -0.16609
C  -1.096664 1.780308 0.178916
C  0.163795 -0.23272 -0.547205
C  1.364464 0.562908 -0.474872
C  0.023489 2.617435 0.123976
C  -2.427294 -0.133419 -0.040287
C  1.275463 1.998594 -0.206177
C  -3.244807 0.981766 0.365968
C  2.727995 0.031583 -0.635757
C  0.113038 -1.640044 -1.13042
C  -3.037806 -1.399493 -0.187624
C  -0.072197 4.108565 0.388688
C  4.338478 -1.894406 -0.688204
C  2.46888 2.792433 -0.340051
C  5.168359 -1.865971 0.626465
C  -4.624184 0.853732 0.595815
C  -4.428264 -1.531276 0.042269
C  3.664347 2.180497 -0.702852
C  -5.222479 -0.41702 0.426031
C  4.485175 -2.673037 1.753372
C  6.592021 -2.395825 0.342056
C  -6.364675 -3.040787 0.079775
H  -2.745571 3.041457 0.759402
H  0.939746 -1.824035 -1.834232
H  0.127627 -2.435463 -0.355158
H  -0.826738 -1.768415 -1.692102
H  -2.481411 -2.298773 -0.458777
H  4.873097 -1.313555 -1.458693
H  4.241251 -2.94283 -1.037162
H  0.596525 4.418715 1.213626
H  0.216628 4.697746 -0.502654
H  -1.094021 4.42149 0.664963
H  5.23915 -0.80494 0.934655
H  2.437454 3.873164 -0.184919
H  2.246745 -1.944359 -0.226757
H  -5.233589 1.710381 0.903284
H  4.570593 2.769647 -0.884703
H  -6.296307 -0.527236 0.601164
H  4.37387 -3.738121 1.466626
H  5.084035 -2.637818 2.682128
H  3.482641 -2.270406 1.99046
H  6.561794 -3.447349 -0.006611
H  7.216303 -2.36352 1.253892
H  7.096003 -1.792664 -0.435996
H  -6.537198 -4.109417 -0.117216
H  -6.972671 -2.432131 -0.618937
H  -6.655422 -2.804469 1.122848
