program: Gaussian 09
title: 000010089
version: EM64L-G09RevD.01
frameworkgroup: C1[X(C23H29NO2)]
method: RPBEPBE
basis: SDD
operation: Freq
keyword: #p
keyword: freq=noraman
keyword: PBEPBE/SDD
title: #p freq=noraman PBEPBE/SDD
converged: YES YES NO NO
title: Mulliken charges:
elementType: O O N C C C C C C C C C C C C C C C C C C C C C C C H H H H H H H H H H H H H H H H H H H H H H H H H H H H H
charge: -0.244186 -0.209754 -0.124109 0.035437 -0.001117 -0.516502 -0.352064 -0.347694 0.401147 0.326466 0.121761 -0.805284 -0.324396 -0.326432 -0.498634 -0.391369 -0.344972 -0.384230 -0.414748 -0.693560 -0.251289 -0.246095 -0.257291 -0.252006 -0.248133 -0.244431 0.235990 0.217545 0.228217 0.201379 0.210753 0.189000 0.223195 0.209179 0.238369 0.247388 0.188869 0.212679 0.212617 0.187883 0.245607 0.256445 0.253115 0.273039 0.261797 0.262323 0.225444 0.211094 0.238654 0.223972 0.229576 0.225051 0.226539 0.227293 0.230473
chargesum: 0.00000
title: Mulliken charges with hydrogens summed into heavy atoms:
elementType: O O N C C C C C C C C C C C C C C C C C C C C C C C
charge: -0.244186 -0.209754 -0.124109 0.035437 0.234872 -0.070741 0.060069 0.064502 0.401147 0.326466 0.121761 -0.110348 0.077152 0.074068 0.003419 -0.138254 -0.071932 -0.122433 -0.152425 -0.018367 -0.027317 -0.016519 -0.032240 -0.025467 -0.020840 -0.013958
polarizability: 2.56201025e+02 -3.86156153e+00 2.50048454e+02 1.78906649e+01 -1.15485979e+01 2.49295259e+02
1716.lowfreq: -24.7659 -9.7770 -9.3502 -0.0003 -0.0003 0.0002 6.2004 32.5310 34.6610
frequency: -20.2870 32.4866 34.4491 41.4770 46.4145 54.0240 65.9127 83.9485 89.7936 106.8944 122.5136 154.0951 157.0383 195.2341 205.2436 226.4949 240.2620 246.7589 264.9750 277.5993 282.1878 289.3623 307.8475 326.6103 345.1234 358.0967 388.2141 399.3461 401.4603 406.4412 452.7003 458.0223 466.9290 483.6707 499.9313 546.0544 585.7611 606.7147 614.4839 616.5483 626.1416 650.1936 700.0252 706.5270 706.9892 739.6973 753.7120 771.0446 789.4272 803.7685 807.4197 841.3105 851.9575 856.8146 859.1309 897.7397 902.3373 906.1183 925.0459 931.8958 954.5343 976.7728 983.4423 989.6297 989.9643 993.0453 993.6287 1000.0649 1020.0792 1023.5258 1028.6126 1031.9357 1038.5048 1048.5657 1052.1078 1068.9634 1077.0768 1086.6734 1092.1110 1096.0412 1100.7058 1108.0114 1124.7403 1136.3710 1159.3386 1173.0623 1174.4369 1175.0719 1189.5734 1197.0619 1199.7476 1200.1356 1243.4743 1249.3547 1260.7008 1272.0500 1291.4359 1305.2561 1321.6484 1323.4947 1324.8553 1330.0551 1336.4293 1339.9165 1355.6769 1369.4305 1372.1916 1378.3009 1383.2919 1389.8856 1391.9470 1431.1901 1434.4098 1435.6701 1441.6791 1447.0564 1448.8289 1460.1126 1465.9472 1469.1525 1479.1849 1481.4631 1481.9043 1484.5483 1493.8784 1584.7655 1588.2733 1602.0837 1607.2241 1612.0544 2860.5871 2873.4406 2914.6975 2950.0131 2954.5078 2982.6533 2987.0002 2995.3780 3000.0973 3035.6031 3043.7669 3056.9320 3059.2948 3076.6004 3078.0447 3080.2713 3087.1341 3089.9111 3104.0488 3118.6789 3123.9893 3128.0636 3130.6364 3140.6056 3143.2946 3153.0111 3158.2630 3165.4708 3185.1449
redmass: 3.9588 4.1241 3.4557 3.4656 3.8229 4.2813 4.4994 4.3719 3.3907 4.0886 3.1173 2.3356 3.7386 1.5844 3.4221 2.7582 2.5741 3.5194 2.7736 3.7262 4.1820 2.4545 4.8999 1.4715 2.0152 3.9097 3.2821 2.3788 2.7422 2.8385 2.5767 2.7584 2.5720 3.2017 3.8299 2.7971 2.2245 4.8408 5.4291 6.2205 3.0915 4.4431 2.7663 1.9878 1.6891 2.7610 2.0210 2.2194 1.7060 3.6624 2.3638 1.6088 1.2652 1.5053 2.0403 2.7019 2.1369 1.7829 1.5187 1.5727 2.4649 1.3876 1.4158 2.6526 5.4692 1.8626 1.9275 1.3791 2.6860 2.2105 2.3081 2.1232 1.9907 2.3575 1.9965 1.8479 3.3822 1.8338 1.9786 2.0770 2.2627 2.5550 2.9343 2.6770 3.6867 1.0514 1.0962 2.1705 1.1332 1.6755 1.3475 1.1545 1.2651 1.3241 1.4691 1.3563 1.2694 1.1966 1.4387 1.5095 1.3456 1.2705 1.3405 1.2381 1.4262 1.2912 5.5059 6.5010 1.3385 1.2967 1.2033 2.1169 2.2149 1.1229 1.0825 1.0780 1.0971 1.1040 1.1255 1.0415 1.2113 1.5013 1.3163 1.6042 1.0496 5.8229 5.9840 7.1160 6.1260 7.0156 1.0708 1.0702 1.0815 1.0664 1.0665 1.0380 1.0605 1.0367 1.0591 1.0887 1.0958 1.1006 1.0894 1.0959 1.0978 1.0974 1.0977 1.1004 1.0998 1.0850 1.0847 1.0880 1.0880 1.0939 1.0927 1.0950 1.0995 1.1012 1.0943
irintensity: 0.4828 0.6907 0.4936 0.1608 0.2362 0.0636 0.1182 0.6818 0.8146 2.0741 2.6975 0.8113 0.3417 0.1278 0.7524 1.0339 1.1602 1.2741 8.5353 2.2493 1.2968 4.6800 0.7167 4.1447 1.9929 5.2597 3.2291 0.3720 0.3252 0.1620 1.5005 0.4579 2.1736 0.5726 6.5550 8.6785 2.8493 8.1744 3.2661 0.5264 21.8742 3.7751 14.6303 34.2833 66.6184 21.0487 27.2568 23.0870 4.7524 10.9049 15.9145 0.1511 0.6559 4.1636 10.2019 9.1171 5.2291 26.4663 5.0395 5.5917 26.0742 0.0283 1.8119 2.7206 0.8340 13.0275 0.6350 1.9355 10.9608 6.6641 16.6104 6.6484 7.2080 24.9348 10.0879 2.3750 32.8421 0.5937 3.4465 23.0266 8.6299 58.1923 12.6570 18.3812 0.5476 0.0185 2.5555 35.7740 0.6237 2.6564 7.2526 2.0813 4.0468 34.0019 5.6307 4.1505 3.3641 5.3498 8.9391 17.8285 8.4862 4.8467 8.9033 11.8767 0.9730 2.4320 1.8897 0.6303 2.8267 31.5702 20.6160 21.2557 5.0996 11.0419 1.9475 1.0109 15.9888 5.1630 18.0399 13.0825 5.9988 13.5383 31.4786 9.9710 12.0728 1.4135 3.4176 52.5258 7.1464 36.3074 65.9899 73.1384 34.0365 32.5620 102.1795 23.9507 17.7925 30.3389 18.5473 38.2052 7.4889 17.4181 34.7347 43.9595 28.1255 35.2699 46.0789 29.7946 22.0203 2.8161 1.3869 3.4703 3.2555 29.6740 16.3914 27.3342 34.3466 23.1464 4.9558
temp: 298.150 k
press: 1.00000 atm
elementType: 8 8 7 6 6 6 6 6 6 6 6 6 6 6 6 6 6 6 6 6 6 6 6 6 6 6 1 1 1 1 1 1 1 1 1 1 1 1 1 1 1 1 1 1 1 1 1 1 1 1 1 1 1 1 1
symmnumber: 1
zpe: 1222331.8 jmol-1
zpe.correction: 0.465562 hartree
zpe.thermalcorrener: 0.489731 hartree
zpe.thermalcorrenthalpy: 0.490675 hartree
zpe.thermalcorrgfe: 0.411596 hartree
zpe.sumelectzpe: -1097.061621 hartree
zpe.sumelectthermal: -1097.037452 hartree
zpe.sumelectthermalent: -1097.036508 hartree
zpe.sumelectthermalfe: -1097.115588 hartree
dipole: 0.5145 -1.3924 0.9872
dipole: 1.7828
quadrupole: -171.9670 -147.1076 -152.1838
quadrupole: -0.7837 15.9428 1.2257
quadrupole: -14.8808 9.9786 4.9023 -0.7837 15.9428 1.2257
hfenergy: -1097.527183 hartree
pointgroup: C01 [X(C23H29N1O2)]
dipole: 0.1546602 -0.6508393 0.2107938 debye
polarizability: 257.5780297|-9.5976091|257.8896447|13.3346014|-10.4325923|240.0770636 unknown
InChI: InChI=1S/C23H29NO2/c1-3-22(25)23(20-10-6-4-7-11-20,21-12-8-5-9-13-21)18-19(2)24-14-16-26-17-15-24/h4-13,19H,3,14-18H2,1-2H3
charge 0 multiplicity 1
55 atoms
O  -5.507287 -0.172903 1.679699
O  1.878284 0.220218 -2.656105
N  -3.020912 -0.342266 0.156939
C  0.840317 -0.178302 -0.437257
C  -1.821689 0.074799 -0.656799
C  -0.59929 -0.702598 -0.083538
C  -3.113934 0.4322 1.426613
C  -4.344009 -0.309876 -0.519359
C  0.886914 1.341597 -0.140411
C  1.927294 -0.914766 0.410284
C  1.273216 -0.577835 -1.89264
C  -2.010568 -0.161715 -2.167661
C  -4.192667 -0.165576 2.342665
C  -5.409821 -0.913762 0.412531
C  1.032322 -2.03076 -2.329066
C  1.022984 1.757216 1.211513
C  3.275079 -0.477838 0.293769
C  0.676133 2.341009 -1.1261
C  1.646803 -2.015703 1.257467
C  1.987915 -2.483211 -3.449832
C  0.953687 3.120314 1.57097
C  4.308415 -1.112815 1.01239
C  0.615106 3.7076 -0.769418
C  2.681883 -2.651022 1.983035
C  0.750537 4.106574 0.578852
C  4.016264 -2.204413 1.864289
H  -1.647161 1.166216 -0.513957
H  -0.681151 -0.674634 1.018639
H  -0.712551 -1.7636 -0.372484
H  -3.358948 1.504746 1.222871
H  -2.140739 0.411995 1.95054
H  -4.654399 0.730344 -0.793099
H  -4.311803 -0.912733 -1.442686
H  -2.200116 -1.228004 -2.393537
H  -2.845407 0.434619 -2.574145
H  -1.1030 0.148794 -2.713221
H  -3.909428 -1.203234 2.623624
H  -4.32569 0.443407 3.252339
H  -6.412877 -0.851306 -0.041835
H  -5.156147 -1.976513 0.618547
H  -0.016701 -2.107115 -2.679261
H  1.111938 -2.697217 -1.450879
H  1.197318 1.005935 1.990661
H  3.50567 0.369177 -0.362619
H  0.586016 2.061881 -2.177733
H  0.62339 -2.386423 1.368066
H  3.035412 -2.473065 -3.100597
H  1.74006 -3.50864 -3.777415
H  1.923811 -1.806993 -4.318441
H  1.063531 3.411454 2.621934
H  5.339624 -0.757394 0.908144
H  0.462789 4.460681 -1.551072
H  2.442534 -3.495583 2.639296
H  0.703541 5.166829 0.851834
H  4.817109 -2.699189 2.424957
