program: Gaussian 09
title: 000146481
version: EM64L-G09RevD.01
frameworkgroup: C1[X(C18H30O4)]
method: RPBEPBE
basis: SDD
operation: Freq
keyword: #pfreq=noraman
keyword: PBEPBE/SDD
title: #p freq=noraman PBEPBE/SDD
converged: YES YES NO NO
title: Mulliken charges:
elementType: O O O O C C C C C C C C C C C C C C C C C C H H H H H H H H H H H H H H H H H H H H H H H H H H H H H H
charge: -0.419517 -0.230838 -0.231673 -0.377212 -0.385542 -0.361488 -0.357944 -0.412338 -0.376320 -0.474368 -0.488805 -0.160347 0.169602 -0.168032 -0.522853 -0.305461 0.379499 -0.582047 -0.174093 -0.166194 -0.444440 -0.667158 0.203837 0.192556 0.185392 0.215590 0.182752 0.202617 0.198910 0.198546 0.214212 0.215082 0.201106 0.209217 0.253620 0.250679 0.227165 0.217510 0.238004 0.209327 0.232039 0.247697 0.212753 0.374738 0.237981 0.217070 0.205730 0.208688 0.212837 0.216668 0.221274 0.353973
chargesum: 0.00000
title: Mulliken charges with hydrogens summed into heavy atoms:
elementType: O O O O C C C C C C C C C C C C C C C C C C
charge: -0.044778 -0.230838 -0.231673 -0.023239 0.010851 0.039494 0.027425 -0.014882 0.052974 -0.064045 0.015494 0.066819 0.169602 0.049477 -0.075522 -0.073421 0.379499 -0.121597 0.063888 0.050876 -0.030022 -0.016380
polarizability: 2.35266024e+02 1.33817675e+01 2.28263524e+02 5.47681432e+00 -9.47622484e+00 1.89221045e+02
1716.lowfreq: -19.5058 -6.7687 -4.8026 -0.0007 -0.0005 -0.0003 2.8038 8.3660 12.3370
frequency: -12.9925 8.2683 12.2752 17.5695 28.7190 34.7927 47.1617 51.3070 55.9999 61.6907 73.3461 86.9380 94.6900 107.8832 121.4914 127.4933 146.1728 157.6396 163.4451 188.3043 197.3382 214.2414 230.7344 238.4928 255.8491 270.2013 302.3049 309.8409 325.8569 347.0973 409.3334 419.9355 438.4837 460.4166 476.8410 485.8858 502.5358 507.5193 529.6428 587.6667 640.5015 667.3660 687.3828 721.6246 732.2651 742.6930 763.7244 790.2807 805.5217 818.2245 833.4262 852.0642 856.4552 864.1613 891.7164 902.4969 924.7499 943.1889 958.7573 974.4017 975.9187 997.7920 1003.0272 1014.6131 1032.0006 1045.2086 1051.9045 1064.0023 1071.2321 1075.1820 1088.9353 1098.5944 1104.2030 1116.2363 1117.9797 1126.0456 1138.3342 1173.6179 1185.4790 1200.0148 1212.5484 1221.9808 1224.6644 1238.3016 1244.4570 1252.6667 1263.4894 1271.2272 1278.7399 1285.9101 1286.3015 1290.8080 1291.6060 1293.3415 1296.8769 1305.3217 1320.2704 1335.2668 1344.7083 1345.7143 1349.3511 1357.5789 1368.5388 1388.1778 1435.8214 1439.2231 1450.8534 1458.1222 1461.8543 1463.5861 1465.2109 1468.0568 1471.4218 1475.0939 1484.6753 1485.1270 1645.7098 1669.6855 1681.4087 1682.3797 2949.4950 2955.6667 2958.8167 2960.7687 2960.8468 2964.9360 2973.3045 2977.5804 2978.3026 2982.9692 2991.1967 2993.4966 3006.0424 3014.2110 3024.7784 3026.6716 3032.8499 3038.0860 3054.4317 3059.9542 3061.4963 3062.5748 3069.6635 3075.6565 3081.0908 3083.1758 3095.7864 3113.2000 3497.2552 3510.6379
redmass: 4.3567 6.2829 10.2016 5.9111 4.2111 3.6116 4.2931 2.2910 2.4725 2.8597 3.5738 3.4812 3.1746 3.2884 2.3065 2.0145 3.3172 2.2776 1.1997 2.6981 1.8610 2.2067 3.1221 2.4429 3.0860 2.8675 3.4012 1.9475 3.2052 2.7164 2.8974 2.7483 2.7695 3.2780 3.6244 3.0684 1.7972 2.1733 3.7399 4.6781 1.3087 4.8018 6.5442 1.1120 1.2029 1.5138 1.4676 1.6087 1.4928 2.2771 1.4108 2.1287 2.9352 2.1381 1.9045 1.8425 1.9513 1.8662 1.4720 1.1672 1.0924 2.3674 2.6222 2.1965 3.0398 2.6139 2.1064 2.1406 2.1174 2.1811 2.0466 2.1266 2.5470 2.1004 1.7599 1.4240 1.7371 1.5587 1.3763 1.2922 1.4060 1.4839 1.3635 1.2253 1.3650 1.3593 1.3311 1.2253 1.1572 1.2608 1.2863 1.2758 1.1479 1.3093 1.1997 1.3043 1.4155 1.4247 1.4271 1.4663 1.4570 1.5895 1.8198 1.2022 1.0847 1.0870 1.0913 1.0754 1.0827 1.0717 1.0732 1.0928 1.0947 1.0427 1.0660 1.0988 7.1006 8.1875 6.5316 6.6841 1.0590 1.0594 1.0608 1.0648 1.0635 1.0622 1.0624 1.0616 1.0364 1.0608 1.0922 1.0631 1.0997 1.1004 1.0956 1.0990 1.0984 1.1036 1.0961 1.1031 1.0924 1.0915 1.0935 1.0994 1.0897 1.1010 1.0894 1.0902 1.0679 1.0639
irintensity: 0.0565 0.1113 1.1127 0.0343 0.1206 0.0296 0.3938 0.0776 0.1012 0.4974 0.2931 1.7880 1.1292 0.8591 0.9486 0.1316 3.7161 22.2017 119.3874 1.2611 0.3334 0.3607 6.8375 5.0055 10.3878 1.0306 1.9414 8.6998 2.0870 0.2161 0.6863 0.4815 11.2775 16.3672 34.6682 11.8045 25.6619 0.8057 8.7696 15.0481 127.3589 12.8930 49.3314 19.3181 2.7928 11.1401 3.1996 3.5777 2.3636 16.3029 14.7671 0.8800 1.0738 1.8376 3.7793 5.6605 5.1528 5.2729 7.6071 56.4055 56.2514 34.3104 50.0646 41.1387 71.6850 8.7977 16.4835 15.6622 42.3396 0.2746 18.1157 5.4505 4.6174 30.1737 4.2918 1.9778 2.3219 10.1711 10.1645 26.9526 4.8250 16.0243 31.0304 0.1986 3.5779 1.0145 10.8994 1.9365 1.2339 0.3060 2.1827 0.5353 1.8375 8.9857 1.8345 13.3433 2.0274 3.9212 6.0901 9.5898 1.4907 2.0361 26.8772 8.6570 35.0540 21.6267 16.2149 1.7433 11.4821 0.9706 5.3374 12.1577 0.7765 11.5436 9.4714 19.2442 9.2944 209.0241 0.7733 0.2370 10.2525 8.0285 10.3048 55.1343 25.3080 98.8299 55.0070 9.3668 43.3058 4.2941 4.6174 41.2534 5.0164 13.8439 9.0453 7.1734 47.9825 82.7141 5.1203 86.1581 14.1984 3.7530 11.6502 58.2133 46.2056 50.9566 27.0653 24.3491 25.4320 17.0009
temp: 298.150 k
press: 1.00000 atm
elementType: 8 8 8 8 6 6 6 6 6 6 6 6 6 6 6 6 6 6 6 6 6 6 1 1 1 1 1 1 1 1 1 1 1 1 1 1 1 1 1 1 1 1 1 1 1 1 1 1 1 1 1 1
symmnumber: 1
zpe: 1160424.0 jmol-1
zpe.correction: 0.441982 hartree
zpe.thermalcorrener: 0.468984 hartree
zpe.thermalcorrenthalpy: 0.469928 hartree
zpe.thermalcorrgfe: 0.378425 hartree
zpe.sumelectzpe: -1002.927578 hartree
zpe.sumelectthermal: -1002.900576 hartree
zpe.sumelectthermalent: -1002.899632 hartree
zpe.sumelectthermalfe: -1002.991135 hartree
dipole: 0.5593 0.9671 -1.4969
dipole: 1.8679
quadrupole: -137.7755 -138.8839 -128.9467
quadrupole: 9.4898 2.1628 2.1904
quadrupole: -2.5735 -3.6819 6.2554 9.4898 2.1628 2.1904
hfenergy: -1003.3695597 hartree
pointgroup: C01 [X(C18H30O4)]
dipole: 0.1606048 -0.3950979 0.5984471 debye
polarizability: 231.6585525|-13.8681119|231.6330328|-6.031363|-9.6179068|189.4590083 unknown
InChI: InChI=1S/C18H30O4/c1-2-3-11-14-17(22-21)15-12-9-7-5-4-6-8-10-13-16-18(19)20/h3,7,9,11,15,19,21H,2,4-6,8,10,12-14,16H2,1H3
charge 0 multiplicity 1
52 atoms
O  5.723685 -0.768425 -0.571624
O  5.237246 1.273667 -1.561465
O  -3.370164 -1.363715 0.381022
O  -4.307847 -2.649393 0.487338
C  0.620057 2.70191 0.781214
C  -0.601036 2.638545 1.726373
C  1.578096 1.502842 0.959991
C  -1.577848 3.831552 1.588537
C  2.797167 1.567114 0.013757
C  -2.252643 3.953763 0.189583
C  3.716943 0.34154 0.166691
C  -3.016238 2.704943 -0.200067
C  4.927029 0.37965 -0.744639
C  -2.783401 1.960722 -1.311792
C  -3.525942 0.677789 -1.666876
C  -2.594224 -0.51847 -1.687418
C  -2.566577 -1.523511 -0.760031
C  -1.672565 -2.751979 -0.799913
C  -0.697987 -2.821693 0.365105
C  0.635016 -3.054086 0.248839
C  1.603486 -3.172635 1.408991
C  2.30864 -4.553125 1.453899
H  0.275114 2.725053 -0.271852
H  1.173742 3.64909 0.952811
H  -0.242204 2.59009 2.775486
H  -1.152085 1.695193 1.537195
H  1.926277 1.46427 2.013968
H  1.015695 0.562032 0.781005
H  -1.042991 4.778465 1.807315
H  -2.372232 3.733796 2.356752
H  2.452859 1.637116 -1.036086
H  3.377203 2.489963 0.206813
H  -2.944586 4.821327 0.217855
H  -1.493112 4.18238 -0.582358
H  3.163517 -0.595315 -0.043013
H  4.081893 0.243893 1.208586
H  -3.80026 2.376416 0.501804
H  -1.990391 2.273918 -2.009791
H  -4.340339 0.49992 -0.94431
H  -3.978456 0.783087 -2.675362
H  -1.826472 -0.547172 -2.473237
H  -2.337215 -3.639566 -0.771785
H  -1.129196 -2.778823 -1.761328
H  6.50947 -0.711408 -1.180896
H  -1.1355 -2.680907 1.36476
H  1.067354 -3.198267 -0.755764
H  2.381763 -2.384673 1.328848
H  1.068016 -2.992919 2.36099
H  2.864129 -4.744035 0.516766
H  3.029807 -4.602642 2.29031
H  1.571835 -5.366357 1.581735
H  -4.376129 -2.676928 1.484068
