program: Gaussian 09
title: 000146465
version: EM64L-G09RevD.01
frameworkgroup: C1[X(C20H16)]
method: RPBEPBE
basis: SDD
operation: Freq
keyword: #p
keyword: freq=noraman
keyword: PBEPBE/SDD
title: #p freq=noraman PBEPBE/SDD
converged: YES YES NO NO
title: Mulliken charges:
elementType: C C C C C C C C C C C C C C C C C C C C H H H H H H H H H H H H H H H H
charge: 0.103727 0.216744 0.478328 0.190779 0.178070 0.455319 -0.620047 -0.798083 0.404739 -0.491181 -0.490835 -0.375322 -0.359449 -0.456362 -0.710479 -0.453523 -0.279334 -0.247831 -0.283188 -0.254674 0.262795 0.230016 0.244682 0.243191 0.237145 0.241387 0.249187 0.244093 0.222721 0.237044 0.227633 0.239506 0.225686 0.229650 0.227546 0.230322
chargesum: 0.00000
title: Mulliken charges with hydrogens summed into heavy atoms:
elementType: C C C C C C C C C C C C C C C C C C C C
charge: 0.103727 0.216744 0.478328 0.190779 0.178070 0.455319 -0.127237 -0.553401 0.404739 -0.247990 -0.253690 -0.133935 -0.110261 -0.212269 -0.023081 -0.214017 -0.053648 -0.018182 -0.055642 -0.024352
polarizability: 4.02550440e+02 -4.76034984e+00 2.35330661e+02 -3.08886769e+00 3.40928681e+00 9.32913189e+01
1716.lowfreq: -11.2522 -0.0008 -0.0007 -0.0003 1.8443 5.4639 50.7472 68.6778 99.1622
frequency: 50.6352 68.6412 99.1498 139.3166 147.2706 184.0157 191.3712 223.5411 250.8362 281.5846 287.5800 341.5525 363.1353 388.6387 411.4939 444.2238 456.3348 505.9693 513.9050 522.8931 533.6536 560.8924 569.5660 581.0042 630.1793 636.1790 666.2477 708.3993 747.8046 752.3214 755.9557 763.4345 785.7316 807.0302 821.8067 830.0127 855.5660 863.4548 885.2481 891.6508 922.8210 925.2455 956.8816 963.3030 981.3127 984.0724 988.0782 990.1912 1030.9710 1036.7389 1054.1853 1063.2938 1091.7652 1114.8832 1139.1431 1167.3674 1178.1275 1178.8129 1204.7114 1230.2764 1236.9565 1252.0768 1268.1754 1292.0418 1298.2159 1322.9761 1335.5545 1370.5678 1391.9521 1397.0222 1407.1219 1407.8996 1429.9699 1434.1801 1452.3238 1470.0859 1484.2194 1495.8151 1496.6548 1530.3984 1545.3993 1564.6762 1593.5523 1613.5195 1625.2612 1638.3149 2981.8848 3003.1690 3062.3276 3075.7010 3086.5137 3116.8185 3119.4659 3120.8538 3121.7624 3133.2592 3133.8896 3144.9916 3154.9034 3158.8157 3172.4803 3232.1834
redmass: 4.2451 4.0453 3.4304 3.3599 1.9587 4.0823 3.4460 1.6334 3.9109 4.4044 4.3719 4.9778 4.4229 2.6707 3.4290 4.9411 3.4299 3.7488 4.6320 3.6207 5.9705 3.4848 3.2750 4.6369 5.9439 3.5683 5.3622 3.4529 1.8373 2.8759 1.7868 1.6182 3.0334 1.5217 1.7449 1.9529 2.8884 1.6309 1.6614 4.0253 2.0594 2.4528 1.3917 1.4217 1.3880 4.0701 1.3451 1.4054 2.3852 3.4788 2.0188 1.9419 2.0141 2.0316 1.6388 1.2910 1.1405 1.1189 1.2810 2.0627 1.6249 1.3574 1.8047 2.1913 1.7371 1.4823 3.7653 4.1561 1.4352 3.1071 2.2135 2.3595 2.6355 6.2523 2.1935 1.0629 2.8174 1.9847 1.3248 1.1311 5.4662 7.1617 5.8015 5.9526 6.6568 6.7685 1.0358 1.0675 1.0927 1.1001 1.0986 1.0891 1.0878 1.0865 1.0866 1.0897 1.0906 1.0991 1.0962 1.0992 1.0961 1.0900
irintensity: 0.0005 0.4666 0.8921 0.5750 0.0217 2.0759 0.6282 0.3170 1.9345 0.2428 0.9558 0.7560 0.8007 2.5475 2.7755 1.6408 0.6523 5.5691 2.5779 3.6756 1.2082 1.2076 10.3596 2.2767 1.7857 2.6895 1.9356 3.6264 8.9109 9.4878 32.5902 78.1711 8.8219 11.8041 20.9158 3.4851 0.1550 11.4500 8.0008 0.0727 31.1318 15.6489 4.7191 9.7324 0.8685 1.8708 0.7587 0.2779 6.8878 1.9331 3.5309 8.3923 0.7993 1.3422 4.8201 8.9173 0.7221 1.2703 3.6278 1.2788 1.9610 1.9384 5.1784 0.8124 2.2237 0.4356 5.0934 3.5529 12.9160 8.7320 0.3685 1.3759 2.7953 0.5620 5.1291 9.2477 4.3121 19.5631 5.6849 22.7502 0.4010 1.4118 1.9469 0.6129 0.9280 2.2410 35.9214 23.9955 1.4817 43.6736 33.1766 1.5895 5.0770 2.6270 5.4780 13.2002 13.1156 38.7229 41.9841 44.3999 29.9134 4.8354
temp: 298.150 k
press: 1.00000 atm
elementType: 6 6 6 6 6 6 6 6 6 6 6 6 6 6 6 6 6 6 6 6 1 1 1 1 1 1 1 1 1 1 1 1 1 1 1 1
symmnumber: 1
zpe: 770959.5 jmol-1
zpe.correction: 0.293643 hartree
zpe.thermalcorrener: 0.308677 hartree
zpe.thermalcorrenthalpy: 0.309621 hartree
zpe.thermalcorrgfe: 0.252178 hartree
zpe.sumelectzpe: -770.400875 hartree
zpe.sumelectthermal: -770.385841 hartree
zpe.sumelectthermalent: -770.384897 hartree
zpe.sumelectthermalfe: -770.442340 hartree
dipole: 0.0890 0.4132 0.0096
dipole: 0.4228
quadrupole: -101.7083 -101.2804 -125.1013
quadrupole: 0.3440 -0.2119 1.0087
quadrupole: 7.6551 8.0829 -15.7380 0.3440 -0.2119 1.0087
hfenergy: -770.6945181 hartree
pointgroup: C01 [X(C20H16)]
dipole: -0.0330454 0.1630233 0.0023969 debye
polarizability: 402.5806647|2.8737718|235.2977598|-5.2672513|1.7741635|93.2939951 unknown
InChI: InChI=1S/C20H16/c1-2-17-18-9-5-4-8-15(18)13-16-12-11-14-7-3-6-10-19(14)20(16)17/h3-13H,2H2,1H3
charge 0 multiplicity 1
36 atoms
C  0.397833 -0.149911 -0.016504
C  -0.648087 0.820826 -0.159083
C  0.012292 -1.562186 0.056461
C  -2.033897 0.411665 -0.068122
C  1.856751 0.140504 0.023752
C  -2.380221 -0.985225 0.130031
C  -0.3952 2.291634 -0.493221
C  -1.338351 -1.941232 0.151222
C  2.80146 -0.946006 -0.133071
C  1.00988 -2.611063 -0.032766
C  2.342444 -2.318893 -0.184458
C  -3.129618 1.345681 -0.169057
C  2.423573 1.43036 0.277573
C  -3.757631 -1.382512 0.244452
C  -0.494069 3.256991 0.722305
C  4.204947 -0.691673 -0.1643
C  -4.457656 0.934682 -0.055941
C  -4.781884 -0.444541 0.159442
C  3.810294 1.660613 0.267692
C  4.716614 0.600205 0.012764
H  0.581441 2.40739 -0.98972
H  -1.138224 2.611751 -1.24754
H  -1.588405 -3.007296 0.219717
H  0.661171 -3.650143 -0.008099
H  3.087941 -3.114677 -0.295924
H  -2.928849 2.407457 -0.331935
H  1.783148 2.26897 0.540346
H  -3.983948 -2.444831 0.395429
H  -0.28008 4.297058 0.413811
H  -1.503803 3.230997 1.167871
H  0.212437 2.983488 1.52645
H  4.884765 -1.540634 -0.3055
H  -5.263919 1.672886 -0.131654
H  -5.829613 -0.75157 0.248371
H  4.18863 2.668197 0.473109
H  5.796235 0.782939 -0.010503
