program: Gaussian 09
title: 000146461
version: EM64L-G09RevD.01
frameworkgroup: C1[X(C7H15N3O2)]
method: RPBEPBE
basis: SDD
operation: Freq
keyword: #p
keyword: freq=noraman
keyword: PBEPBE/SDD
title: #p freq=noraman PBEPBE/SDD
converged: YES YES NO NO
title: Mulliken charges:
elementType: O O N N N C C C C C C C H H H H H H H H H H H H H H H
charge: -0.256448 -0.240560 -0.141920 0.032170 -0.624486 -0.354491 -0.355932 -0.358044 -0.406348 -0.356007 -0.694547 0.301034 0.194470 0.196756 0.217314 0.220368 0.193659 0.194402 0.248386 0.254616 0.196632 0.197380 0.210840 0.210725 0.216613 0.358014 0.345406
chargesum: 0.00000
title: Mulliken charges with hydrogens summed into heavy atoms:
elementType: O O N N N C C C C C C C
charge: -0.256448 -0.240560 -0.141920 0.032170 0.078934 0.036734 0.081749 0.030017 0.096654 0.038004 -0.056369 0.301034
polarizability: 1.28933605e+02 -2.27351835e-01 1.13414301e+02 8.77021859e+00 -3.06834274e+00 7.90438390e+01
1716.lowfreq: -8.9885 -0.0012 -0.0009 -0.0009 1.8754 12.4623 24.6675 44.6467 59.6079
frequency: 24.4514 44.3491 59.5470 66.4660 91.5886 116.8964 132.5769 139.5113 212.9493 228.6543 244.7947 284.7602 324.8797 350.8541 419.1298 446.9399 473.0402 527.0629 554.8921 631.9952 642.2409 714.9956 727.9036 736.6402 775.1397 819.3029 860.6828 889.9859 936.1430 999.7921 1010.7646 1024.2939 1061.0683 1065.5238 1079.9009 1118.5008 1160.7768 1180.8646 1215.5610 1236.9077 1265.1899 1287.3873 1293.6868 1295.4827 1319.0506 1339.1172 1350.8305 1355.6663 1365.4049 1375.6459 1389.2741 1437.5770 1465.0190 1465.3606 1473.0587 1477.2148 1481.5663 1488.6260 1562.9196 1678.6979 2955.9327 2960.3975 2970.0862 2973.5785 2991.3594 2993.7173 3010.0985 3024.9084 3033.1480 3055.9605 3070.6720 3072.8372 3103.3409 3511.1663 3685.0886
redmass: 5.3103 1.7296 3.8283 3.1416 5.9939 1.7280 2.2219 4.9322 5.2767 1.1223 5.0758 4.5724 2.6531 4.6457 3.3211 4.1037 5.5593 2.1569 1.5536 4.2738 1.1039 10.0999 1.0657 1.1607 1.2995 4.2582 1.5031 1.9122 1.7222 1.3524 3.7029 3.2937 2.5018 2.5962 2.2638 2.5768 3.7233 2.2008 1.5828 1.2745 1.2918 1.0433 1.2991 1.1290 1.2990 1.3950 1.9090 1.6456 4.1502 2.2733 1.2167 1.1372 1.0705 1.0714 1.0732 1.0436 1.0773 1.0903 1.2304 7.7362 1.0588 1.0589 1.0590 1.0364 1.0587 1.0980 1.1016 1.0606 1.1034 1.1036 1.1008 1.0993 1.1036 1.0468 1.1032
irintensity: 0.1714 0.1050 2.2101 0.2490 8.1159 0.0558 0.0410 1.1713 8.6259 0.0215 0.7170 17.8009 3.0752 2.9552 1.3020 8.2037 12.9733 57.1532 83.9629 31.2322 151.1774 32.5141 13.5983 12.1525 13.3122 36.9735 38.6638 5.5355 80.0180 20.3615 0.0181 5.5204 0.8620 0.9451 0.0332 15.5110 76.5354 0.5721 0.2740 4.7731 0.9827 1.7311 0.0365 0.7773 35.8806 1.8928 158.1339 0.9199 120.1666 98.8865 10.9704 26.3265 0.3704 0.6141 1.8177 12.2638 3.8485 23.5157 179.2323 301.8880 0.0274 7.9565 90.4033 34.8179 29.7845 0.3593 0.3252 19.6362 34.2775 37.2850 92.8971 53.2111 4.6359 48.7090 77.8400
temp: 298.150 k
press: 1.00000 atm
elementType: 8 8 7 7 7 6 6 6 6 6 6 6 1 1 1 1 1 1 1 1 1 1 1 1 1 1 1
symmnumber: 1
zpe: 593415.9 jmol-1
zpe.correction: 0.226020 hartree
zpe.thermalcorrener: 0.240280 hartree
zpe.thermalcorrenthalpy: 0.241224 hartree
zpe.thermalcorrgfe: 0.182973 hartree
zpe.sumelectzpe: -589.438480 hartree
zpe.sumelectthermal: -589.424220 hartree
zpe.sumelectthermalent: -589.423275 hartree
zpe.sumelectthermalfe: -589.481527 hartree
dipole: -0.4883 -0.5764 -0.6007
dipole: 0.9652
quadrupole: -59.4971 -86.5013 -71.6769
quadrupole: 4.0436 5.5817 2.9950
quadrupole: 13.0613 -13.9429 0.8816 4.0436 5.5817 2.9950
hfenergy: -589.6644997 hartree
pointgroup: C01 [X(C7H15N3O2)]
dipole: 0.1914866 0.2392361 -0.2242476 debye
polarizability: 128.9436884|0.2719156|113.0096851|-8.7527215|4.7898987|79.4383717 unknown
InChI: InChI=1S/C7H15N3O2/c1-2-3-4-5-6-10(9-12)7(8)11/h2-6,8H2,1H3
charge 0 multiplicity 1
27 atoms
O  2.221421 2.109179 0.413398
O  1.874684 -2.443924 -0.182146
N  1.96021 -0.215957 0.171676
N  2.555783 -1.37324 -0.340442
N  3.892399 0.872784 -0.669951
C  -1.891949 -0.055616 0.580727
C  -0.532418 -0.047686 -0.152987
C  -3.090314 0.100769 -0.38229
C  0.640714 -0.215384 0.841083
C  -4.455603 0.096536 0.342621
C  -5.649109 0.247519 -0.625044
C  2.695881 1.023956 -0.014304
H  -2.001074 -1.003209 1.148153
H  -1.912912 0.7647 1.327679
H  -0.505402 -0.866036 -0.897784
H  -0.408269 0.907393 -0.698506
H  -3.070675 -0.719403 -1.129597
H  -2.98273 1.046397 -0.953173
H  0.55249 -1.179087 1.37435
H  0.648407 0.614981 1.565588
H  -4.560607 -0.846894 0.916256
H  -4.475371 0.917914 1.087542
H  -5.586351 1.198513 -1.186887
H  -5.667298 -0.576825 -1.362591
H  -6.612878 0.238027 -0.083763
H  4.193708 -0.052916 -0.97734
H  4.457364 1.702609 -0.830969
