program: Gaussian 09
title: 000146456
version: EM64L-G09RevD.01
frameworkgroup: C1[X(C11H24N4)]
method: RPBEPBE
basis: SDD
operation: Freq
keyword: #pfreq=noraman
keyword: PBEPBE/SDD
title: #p freq=noraman PBEPBE/SDD
converged: YES YES NO NO
title: Mulliken charges:
elementType: N N N N C C C C C C C C C C C H H H H H H H H H H H H H H H H H H H H H H H H
charge: -0.096197 -0.096195 -0.064451 -0.064478 -0.301924 -0.342380 -0.364662 -0.342309 -0.364664 -0.386555 -0.372813 -0.386617 -0.372786 -0.614939 -0.614918 0.185005 0.184986 0.231924 0.183221 0.186336 0.202847 0.231911 0.183226 0.186355 0.202827 0.204480 0.184574 0.183269 0.202836 0.204504 0.184569 0.183264 0.202841 0.220805 0.185777 0.221873 0.221890 0.220808 0.185759
chargesum: 0.00000
title: Mulliken charges with hydrogens summed into heavy atoms:
elementType: N N N N C C C C C C C C C C C
charge: -0.096197 -0.096195 -0.064451 -0.064478 0.068067 0.072765 0.024521 0.072828 0.024517 0.002499 0.013293 0.002456 0.013318 0.013516 0.013540
polarizability: 1.80098434e+02 1.27753102e-03 1.33416253e+02 -4.74171912e+00 -2.22385304e-03 1.26180322e+02
1716.lowfreq: 0.0007 0.0009 0.0010 5.2383 12.6759 23.1874 41.3080 48.7099 60.1345
frequency: 41.3047 48.5335 60.1215 110.3283 128.0672 205.6618 210.4605 224.8644 225.4219 232.9966 261.9217 282.6194 301.5874 314.8541 333.6025 352.8320 362.2098 388.6659 399.1265 433.7125 481.6212 491.2834 507.0914 612.1339 620.5787 748.3110 750.1293 785.4852 785.8547 851.1917 851.2810 906.3677 931.1553 1007.1198 1007.8822 1015.9894 1018.6390 1027.4998 1050.7261 1052.3747 1068.0349 1074.4592 1080.8168 1088.9464 1119.0761 1120.4701 1143.0756 1145.2735 1146.6217 1149.4073 1156.2855 1162.2418 1190.2908 1193.2414 1205.7242 1234.1189 1269.6554 1278.9334 1283.0502 1285.0399 1301.4958 1303.9759 1308.7899 1331.4857 1335.2592 1346.5040 1358.8395 1363.1368 1369.4584 1371.0743 1377.4817 1405.7260 1428.1803 1428.2529 1451.9829 1452.0531 1453.4543 1456.3820 1458.8176 1458.9522 1466.8586 1468.4930 1472.2570 1474.9073 1476.7515 1481.3214 1481.4156 2830.0313 2843.3987 2843.5121 2844.4706 2844.9823 2859.0189 2861.5760 2863.9842 2864.9590 2870.4167 2877.0286 2878.2763 3014.5734 3014.6795 3021.1123 3021.2256 3023.3469 3023.6708 3027.2261 3027.7016 3058.3171 3059.1632 3072.7669 3072.8580
redmass: 3.6587 3.2805 2.6917 3.0801 3.4195 2.9139 2.5069 1.8291 1.1628 1.7209 1.7527 1.9568 1.9668 2.2713 2.0412 2.4520 2.3761 2.2812 1.8784 3.2496 2.9814 2.7091 4.0488 2.1286 1.9952 3.8618 3.6698 3.1971 2.9075 1.5184 1.5300 2.0231 1.9734 2.4084 2.4087 2.5261 1.7183 2.3315 1.5933 1.6156 1.6631 1.7152 1.6507 1.5879 1.7103 1.6218 2.2319 2.5016 2.4336 2.6525 3.0270 2.7455 1.1577 1.0742 1.3656 2.6818 2.0458 1.5942 1.5068 1.5712 1.4594 1.3762 1.4264 1.2823 1.2695 1.3288 1.4249 1.4236 1.4079 1.4528 1.5343 1.3782 1.1703 1.1702 1.0789 1.0796 1.0847 1.0847 1.0664 1.0671 1.0775 1.0978 1.0900 1.1114 1.1022 1.0535 1.0538 1.0539 1.0693 1.0686 1.0639 1.0643 1.0670 1.0653 1.0702 1.0695 1.0852 1.0671 1.0827 1.0723 1.0723 1.0904 1.0904 1.0881 1.0883 1.0888 1.0888 1.0886 1.0890 1.1008 1.1008
irintensity: 0.0030 0.0606 0.0687 6.7770 0.1232 0.3269 0.0042 0.0711 0.1815 0.1980 3.5768 1.0674 0.0017 11.2624 20.5068 1.9207 0.6276 0.1152 0.0685 0.9199 0.0868 0.1792 0.1663 0.6572 0.6320 4.9387 3.8995 8.3424 21.2920 0.0060 0.0390 3.8119 1.9063 123.5763 1.3848 0.1270 2.7434 4.5416 1.7673 5.3262 5.5776 9.7897 3.1091 10.8493 74.5690 0.6079 0.0063 10.3241 18.8743 125.4363 59.3480 13.7429 0.9084 1.4331 5.8159 8.2738 1.9261 16.8975 16.3456 51.1794 21.6932 0.3323 0.7560 18.6782 0.2712 40.2961 1.3496 14.2726 0.9841 2.3404 0.0095 21.2029 2.9861 0.1842 0.0135 0.6411 4.5994 1.5149 5.6856 46.6133 4.5658 18.9422 22.7881 5.2978 0.0771 10.9082 5.5998 51.0906 72.2225 82.5885 100.6825 1.2560 68.5808 85.6574 30.8174 1.3755 81.0285 379.0577 297.3055 80.4603 17.8405 26.2453 17.0793 45.2350 154.5074 58.1333 13.3268 10.5232 22.7475 37.2327 36.7519
temp: 298.150 k
press: 1.00000 atm
elementType: 7 7 7 7 6 6 6 6 6 6 6 6 6 6 6 1 1 1 1 1 1 1 1 1 1 1 1 1 1 1 1 1 1 1 1 1 1 1 1
symmnumber: 1
zpe: 918839.5 jmol-1
zpe.correction: 0.349967 hartree
zpe.thermalcorrener: 0.365480 hartree
zpe.thermalcorrenthalpy: 0.366424 hartree
zpe.thermalcorrgfe: 0.307563 hartree
zpe.sumelectzpe: -651.273057 hartree
zpe.sumelectthermal: -651.257544 hartree
zpe.sumelectthermalent: -651.256600 hartree
zpe.sumelectthermalfe: -651.315462 hartree
dipole: 0.0002 -0.2163 -0.0007
dipole: 0.2163
quadrupole: -92.0527 -90.6234 -93.7974
quadrupole: -0.0015 -5.5263 -0.0004
quadrupole: 0.1052 1.5344 -1.6396 -0.0015 -5.5263 -0.0004
hfenergy: -651.6230243 hartree
pointgroup: C01 [X(C11H24N4)]
dipole: 0.0001319 -0.0851041 0.0007134 debye
polarizability: 180.1169479|-0.018592|133.4151299|-4.6351654|-0.0915452|126.162931 unknown
InChI: InChI=1S/C11H24N4/c1-12-3-7-14(8-4-12)11-15-9-5-13(2)6-10-15/h3-11H2,1-2H3
charge 0 multiplicity 1
39 atoms
N  -1.204853 0.616298 0.124423
N  1.203661 0.614953 -0.142009
N  -3.868651 -0.41383 -0.292267
N  3.869268 -0.400841 0.298676
C  -0.00116 1.453337 -0.018718
C  -1.542484 -0.137963 -1.105571
C  -2.384705 1.338753 0.64846
C  1.542458 -0.110131 1.105136
C  2.382263 1.32655 -0.683149
C  -2.680541 -1.128929 -0.819968
C  -3.522432 0.342777 0.934185
C  2.682425 -1.105394 0.842985
C  3.521615 0.326044 -0.945368
C  -5.023791 -1.308256 -0.094681
C  5.025721 -1.297935 0.121864
H  0.034535 2.128368 0.874336
H  -0.037852 2.10682 -0.927632
H  -0.634701 -0.672117 -1.435211
H  -1.864499 0.553465 -1.925111
H  -2.760142 2.105976 -0.074808
H  -2.103315 1.856712 1.585133
H  0.635598 -0.63826 1.446807
H  1.862955 0.600548 1.908637
H  2.756462 2.11161 0.021377
H  2.100026 1.821538 -1.631935
H  -2.966494 -1.645356 -1.755848
H  -2.312165 -1.901397 -0.096364
H  -3.198658 -0.340618 1.761511
H  -4.419652 0.89378 1.274814
H  2.969081 -1.598783 1.791012
H  2.315778 -1.895744 0.138059
H  3.19895 -0.377314 -1.75622
H  4.417851 0.870347 -1.299095
H  -5.899165 -0.720286 0.236206
H  -4.840716 -2.112048 0.664274
H  -5.283305 -1.797074 -1.051289
H  5.286364 -1.76358 1.089654
H  5.900035 -0.716642 -0.223277
H  4.843436 -2.119671 -0.61783
