program: Gaussian 09
title: 000146422
version: EM64L-G09RevD.01
frameworkgroup: C1[X(C7H7N7)]
method: RPBEPBE
basis: SDD
operation: Freq
keyword: #p
keyword: freq=noraman
keyword: PBEPBE/SDD
title: #p freq=noraman PBEPBE/SDD
converged: NO YES NO NO
title: Mulliken charges:
elementType: N N N N N N N C C C C C C C H H H H H H H
charge: -0.053618 -0.132200 -0.112996 0.040812 0.002860 -0.579861 -0.580053 0.052211 0.061954 0.030958 0.036288 -0.339624 -0.300329 -0.249008 0.285209 0.243926 0.245550 0.333797 0.343060 0.335392 0.335672
chargesum: 0.00000
title: Mulliken charges with hydrogens summed into heavy atoms:
elementType: N N N N N N N C C C C C C C
charge: -0.053618 -0.132200 -0.112996 0.040812 0.002860 0.096996 0.091011 0.052211 0.061954 0.030958 0.036288 -0.054415 -0.056403 -0.003457
polarizability: 1.92202803e+02 -2.64693176e+00 1.45100875e+02 2.61392346e-03 -6.02922382e-03 5.01169161e+01
1716.lowfreq: -8.8367 -5.2502 -0.0010 -0.0008 -0.0004 6.7773 22.9013 79.6559 121.8700
frequency: 22.4674 79.6507 121.8685 174.1001 180.2272 194.7197 275.9881 338.0368 348.6505 376.7673 458.9451 492.3247 512.7586 514.0284 551.0215 560.8667 564.4343 591.4428 605.7034 695.2882 716.8541 722.5283 769.2251 809.3735 860.9510 870.3499 906.1184 957.7819 959.7589 969.3735 984.6630 988.3426 1038.5004 1129.5428 1146.2223 1186.4556 1236.0284 1258.4929 1282.2669 1351.2541 1382.7709 1416.3016 1441.3637 1476.7520 1497.7739 1511.0806 1520.4672 1530.1712 1598.4001 1628.4888 3129.9955 3155.6811 3183.0376 3550.5835 3554.3876 3711.5871 3713.9602
redmass: 5.5970 5.5995 5.4138 7.5185 6.0699 4.3035 4.2045 4.0583 4.2496 3.4977 6.3300 1.2149 1.2578 3.6370 1.0479 7.7452 1.0404 8.0334 8.4069 6.7940 11.7436 7.5730 2.5769 6.7381 1.6627 5.7130 8.1434 1.5591 1.3982 5.2254 3.4477 2.7558 2.4210 2.4499 2.1849 3.0213 8.0549 5.2649 1.6076 2.1891 2.5496 4.3494 2.5508 6.6483 6.9365 2.2772 3.9501 4.2516 1.4825 2.0987 1.0881 1.0982 1.0936 1.0441 1.0444 1.1060 1.1059
irintensity: 0.0246 3.1937 2.0418 0.1656 3.8896 10.6665 2.8148 4.6430 6.1376 3.0656 47.1902 94.1047 462.0769 1.6882 16.5167 2.8614 0.1967 7.7698 1.9686 6.4530 0.0262 7.5331 4.5389 55.7342 14.4349 4.3308 18.1143 0.5471 2.0707 14.9208 0.7079 3.0975 4.2696 0.2746 16.8946 5.5543 17.2092 7.8764 6.8768 101.4085 12.8532 6.7434 32.5741 372.5465 40.1113 114.1765 329.2335 162.0001 683.8645 288.1801 3.2289 50.8486 0.2839 141.7429 88.4782 48.3135 51.9484
temp: 298.150 k
press: 1.00000 atm
elementType: 7 7 7 7 7 7 7 6 6 6 6 6 6 6 1 1 1 1 1 1 1
symmnumber: 1
zpe: 399589.7 jmol-1
zpe.correction: 0.152196 hartree
zpe.thermalcorrener: 0.163526 hartree
zpe.thermalcorrenthalpy: 0.164470 hartree
zpe.thermalcorrgfe: 0.113840 hartree
zpe.sumelectzpe: -653.230342 hartree
zpe.sumelectthermal: -653.219012 hartree
zpe.sumelectthermalent: -653.218068 hartree
zpe.sumelectthermalfe: -653.268698 hartree
dipole: -2.7981 -0.1802 0.0005
dipole: 2.8039
quadrupole: -62.3392 -68.7373 -83.2168
quadrupole: -6.7145 0.0025 0.0026
quadrupole: 9.0919 2.6938 -11.7857 -6.7145 0.0025 0.0026
hfenergy: -653.382538 hartree
pointgroup: C01 [X(C7H7N7)]
dipole: -1.1009428 -0.0694668 0.000189 debye
dipolederiv: -1.350674 -0.5950514 -0.0000591 -0.258641 -0.8007212 -0.0001053 -0.0000743 -0.0000985 -0.1783907 -1.3942937 0.5676568 0.000089 0.192865 -0.8726246 -0.0001083 0.0001025 -0.0000826 -0.1896448 -0.6499664 -0.0127718 0.0000261 -0.0264547 -1.4101913 -0.0001678 0.0000328 -0.0001536 -0.2608014 -0.1544286 0.0319294 -0.0000192 -0.0285069 -0.1833566 -0.0000067 -0.0000019 -0.0000165 -0.2299209 -0.1754751 -0.0125484 -0.0000052 -0.0200392 -0.2050163 -0.0000183 0.0000146 -0.0000096 -0.2790745 -0.6406705 -0.6244261 -0.0001096 -0.6866146 -1.1712444 -0.0000986 -0.0001663 -0.0001681 -0.7050729 -0.5887878 0.5905592 0.0000505 0.6674012 -1.2141305 -0.0000425 0.0000181 0.0000183 -0.7115962 1.2847189 0.055133 -0.0000201 0.0348106 0.9923607 0.0001644 0.0000855 0.0000992 0.0676157 0.2391551 -0.1022443 0.0000677 0.2520841 -0.0775321 0.0000847 -0.0000311 0.000094 0.068409 1.3567993 0.6488003 0.0000591 0.6418234 1.7218786 0.0002592 0.0001159 0.0002623 0.2285354 1.3311605 -0.613699 -0.0000864 -0.6228625 1.7749125 0.0001517 -0.0001666 0.0001481 0.2309432 -0.1714843 0.0436405 0.0000056 -0.2505855 0.1677061 -0.0001096 0.0001196 -0.0000669 0.0214626 -0.1761101 -0.0500014 0.0000142 -0.4975585 0.2719302 -0.0001204 0.0001476 -0.0001144 -0.0029332 0.2732752 -0.0871149 0.0000671 0.3567214 -0.0544488 0.0000242 -0.0001557 0.0000027 0.0001922 0.1385396 0.0558606 -0.0000393 0.1065222 0.0291187 0.0000616 -0.0000995 0.0000301 0.1313397 -0.0005191 0.0756906 -0.0000358 0.1375849 -0.0482846 0.0000801 -0.0000527 0.00008 0.1298348 -0.1243415 0.0346698 -0.0000296 -0.0002877 0.1001308 0.0000163 0.000011 0.0000191 0.134589 0.236338 0.0772785 0.0000247 0.0440121 0.1999985 -0.0000255 0.0000424 -0.0000034 0.3870741 0.1685845 0.0061435 -0.0000048 0.0605517 0.292435 -0.0000036 0.000025 0.0000411 0.3853575 0.2344089 -0.0757612 0.0000044 -0.0466283 0.2052708 -0.000019 0.000026 -0.0000328 0.3870052 0.1637712 -0.0137437 0.0000007 -0.0561977 0.2818084 -0.0000169 0.0000072 -0.0000486 0.3850762 unknown
polarizability: 192.195811|-2.7084157|145.107867|0.002606|-0.0060326|50.1169161 unknown
InChI: InChI=1S/C7H7N7/c8-6-12-5(13-7(9)14-6)4-3-10-1-2-11-4/h1-3H,8-9H2
charge 0 multiplicity 1
21 atoms
N  -0.926921 -1.245563 -0.00007
N  -0.875924 1.182658 0.000206
N  -3.026269 0.020357 0.000228
N  1.877246 -1.255365 0.000631
N  3.301375 1.229726 -0.00038
N  -3.000116 -2.323751 -0.000182
N  -2.901897 2.359604 0.000392
C  -0.275567 -0.049808 0.000054
C  1.219767 -0.051559 0.000097
C  -2.303777 -1.146367 0.000007
C  -2.254314 1.153227 0.000285
C  1.935967 1.179462 -0.000418
C  3.23857 -1.201483 0.000663
C  3.948437 0.024869 0.000181
H  1.394175 2.127319 -0.000861
H  3.765805 -2.161786 0.001083
H  5.043218 0.053233 0.000238
H  -4.016731 -2.304961 -0.000104
H  -2.478369 -3.196999 -0.000243
H  -3.918561 2.377962 0.000458
H  -2.352011 3.214722 0.000535
