program: Gaussian 09
title: 000010083
version: EM64L-G09RevD.01
frameworkgroup: C1[X(C18H21NO)]
method: RPBEPBE
basis: SDD
operation: Freq
keyword: #p
keyword: freq=noraman
keyword: PBEPBE/SDD
title: #p freq=noraman PBEPBE/SDD
converged: YES YES NO NO
title: Mulliken charges:
elementType: O N C C C C C C C C C C C C C C C C C C H H H H H H H H H H H H H H H H H H H H H
charge: -0.474057 -0.375996 -0.190682 -0.008013 -0.400500 -0.424344 -0.357749 -0.413288 0.368298 0.396922 -0.398327 -0.404791 -0.373423 -0.382926 -0.263626 -0.227329 -0.224659 -0.247443 -0.242980 -0.243408 0.206355 0.219157 0.227863 0.218828 0.187998 0.296719 0.195507 0.205222 0.181892 0.215484 0.357961 0.227368 0.288095 0.278019 0.235471 0.224543 0.222563 0.224880 0.221694 0.227933 0.224770
chargesum: 0.00000
title: Mulliken charges with hydrogens summed into heavy atoms:
elementType: O N C C C C C C C C C C C C C C C C C C
charge: -0.116097 -0.079277 0.015673 -0.008013 0.046520 -0.017517 0.042980 -0.015913 0.368298 0.396922 -0.170958 -0.116697 -0.095404 -0.147455 -0.039083 -0.004766 0.000221 -0.025749 -0.015047 -0.018638
polarizability: 1.91681946e+02 6.84975489e+00 2.19071249e+02 2.79496203e+00 9.57123107e+00 1.73762128e+02
1716.lowfreq: -6.0794 -0.0005 0.0003 0.0005 10.0033 12.4576 40.4083 43.7606 60.2768
frequency: 40.2680 43.7251 60.1830 61.3973 81.8867 86.3667 167.3451 205.2053 227.9882 243.3572 255.0287 269.0611 293.8887 301.1354 347.2476 354.4797 403.4327 405.3753 431.6493 440.3313 471.7717 512.8540 526.9336 545.9456 615.9677 616.9336 630.5502 651.4737 686.1153 706.2291 710.1572 733.1855 758.0263 777.0776 789.7874 825.3861 840.9452 856.1543 860.6788 871.5402 882.3260 919.2071 924.1705 928.8851 948.8236 962.9214 979.9685 981.5170 987.2594 990.0516 993.3288 998.5601 1002.0944 1028.0838 1030.6773 1050.7302 1074.8935 1079.3285 1079.8105 1108.7144 1125.2045 1134.2464 1155.7448 1167.6315 1170.6412 1172.5007 1184.5595 1191.1733 1199.2781 1218.6618 1247.6418 1263.4097 1291.7639 1306.8595 1312.6494 1318.6715 1335.8657 1339.9193 1348.2819 1356.9486 1374.3103 1380.5254 1387.0988 1430.4863 1435.1197 1451.3585 1460.6641 1465.0677 1467.9825 1477.3651 1480.0172 1481.2742 1587.3929 1591.0230 1606.9725 1611.9701 2880.1947 2903.2613 2964.5005 2986.9708 2999.7144 3031.3814 3037.3045 3052.4523 3068.8054 3115.4188 3119.1487 3126.5466 3128.0886 3138.3220 3141.1660 3155.7628 3157.2730 3168.8115 3175.2248 3248.9046 3400.6253
redmass: 3.8461 3.9754 3.7506 4.5540 3.6952 3.2095 3.8549 4.3808 2.3533 3.3858 5.1775 4.4576 2.8428 4.5092 2.3832 5.3649 2.8686 2.8767 3.3304 3.2424 3.6540 2.9537 3.1986 1.8620 6.3958 6.4138 5.6661 4.4567 1.3846 1.7407 1.7620 2.7890 1.7876 2.2445 1.6690 2.1683 1.5265 1.2612 1.2853 2.0990 3.2282 1.6279 1.4781 1.6110 2.5028 2.8400 1.3931 1.3923 3.3741 5.8697 3.0017 1.3236 1.3749 2.1851 2.1188 2.6622 1.5345 1.5858 1.8350 1.9431 2.4276 2.4201 1.4318 1.5117 1.1261 1.3235 1.2107 1.1410 2.1431 1.9081 1.2803 1.2504 1.2799 1.3138 1.3392 1.3442 1.3129 1.4043 1.5092 1.5695 3.3481 3.8712 2.2709 2.1784 2.2135 1.1124 1.2737 1.0982 1.0920 2.1571 1.6253 1.3383 6.0559 6.2732 6.0919 6.0895 1.0709 1.0805 1.0642 1.0612 1.0617 1.0908 1.0938 1.1035 1.1023 1.0851 1.0843 1.0872 1.0882 1.0932 1.0938 1.0969 1.0989 1.0977 1.0953 1.0637 1.0736
irintensity: 0.1316 0.3431 0.7456 0.4493 0.7776 0.4740 0.8846 0.1049 1.8517 2.9625 0.0380 0.5447 3.4196 1.8819 3.1109 11.2814 0.0780 0.1994 2.5567 2.1525 2.6375 2.5866 11.4385 8.5967 0.1843 0.0842 19.4765 6.9867 52.9115 71.8901 57.8553 11.1965 27.0780 20.6752 131.1780 29.3648 18.1958 2.2264 6.1477 2.6477 3.4858 10.6616 1.2739 2.2066 0.3740 28.6317 1.3669 0.0567 0.9363 0.4432 2.8242 0.1459 1.3815 8.3101 10.5924 24.3733 10.8894 1.7777 3.8929 8.7455 26.2690 11.3459 0.8872 12.6597 2.4461 7.6351 9.2788 0.9723 11.9707 19.8985 5.5759 3.5100 10.2366 27.4624 9.7457 6.9096 6.3469 1.8533 6.5066 60.0038 8.1046 1.4235 30.5991 2.0983 30.4007 24.8362 16.2453 7.2619 7.0296 23.4972 11.6818 8.8600 0.9058 0.5573 9.2585 3.8166 93.7659 49.6952 42.1572 30.2806 13.5973 60.7661 59.5941 50.3703 30.6924 8.4800 1.4088 2.0792 8.8824 30.1172 38.3506 26.3045 28.7598 15.3181 9.4713 159.7105 1.8665
temp: 298.150 k
press: 1.00000 atm
elementType: 8 7 6 6 6 6 6 6 6 6 6 6 6 6 6 6 6 6 6 6 1 1 1 1 1 1 1 1 1 1 1 1 1 1 1 1 1 1 1 1 1
symmnumber: 1
zpe: 910289.8 jmol-1
zpe.correction: 0.346711 hartree
zpe.thermalcorrener: 0.363858 hartree
zpe.thermalcorrenthalpy: 0.364803 hartree
zpe.thermalcorrgfe: 0.301490 hartree
zpe.sumelectzpe: -827.022801 hartree
zpe.sumelectthermal: -827.005654 hartree
zpe.sumelectthermalent: -827.004710 hartree
zpe.sumelectthermalfe: -827.068022 hartree
dipole: 1.4616 -1.3899 -2.0103
dipole: 2.8477
quadrupole: -113.9789 -111.3819 -115.6559
quadrupole: 0.0084 -0.0679 1.9185
quadrupole: -0.3067 2.2903 -1.9836 0.0084 -0.0679 1.9185
hfenergy: -827.3695123 hartree
pointgroup: C01 [X(C18H21N1O1)]
dipole: -0.7568112 0.0307429 0.8255666 debye
polarizability: 195.2962397|10.7824031|212.1818123|-6.0265018|-14.33598|177.037271 unknown
InChI: InChI=1S/C18H21NO/c20-18(15-9-3-1-4-10-15,16-11-5-2-6-12-16)17-13-7-8-14-19-17/h1-6,9-12,17,19-20H,7-8,13-14H2
charge 0 multiplicity 1
41 atoms
O  -0.428382 -0.011679 -1.874593
N  -2.502556 0.039181 -0.167078
C  -1.257825 0.727366 0.288409
C  -0.07894 -0.022646 -0.444335
C  -1.31479 2.225724 -0.086708
C  -2.62113 2.890052 0.402489
C  -3.851275 2.129237 -0.140557
C  -3.780379 0.651375 0.284427
C  0.053116 -1.495208 0.029193
C  1.257451 0.71741 -0.270343
C  -0.22992 -1.917585 1.353995
C  1.844877 1.400382 -1.362099
C  0.516694 -2.459004 -0.903343
C  1.907729 0.74579 0.989618
C  -0.056022 -3.268799 1.735736
C  3.058859 2.104969 -1.195299
C  0.696578 -3.805665 -0.523167
C  3.115487 1.457747 1.158669
C  0.409958 -4.218265 0.799968
C  3.697246 2.141554 0.065477
H  -1.116321 0.657221 1.392486
H  -1.24169 2.318209 -1.187037
H  -0.435943 2.737621 0.343845
H  -2.646408 3.948534 0.081871
H  -2.652017 2.89036 1.512559
H  -2.464495 -0.962978 0.077535
H  -4.791328 2.575524 0.235937
H  -3.868182 2.189789 -1.246059
H  -3.891882 0.596941 1.39528
H  -4.612294 0.07582 -0.161824
H  -1.435233 -0.083223 -1.856458
H  -0.588172 -1.201204 2.103288
H  1.338901 1.362963 -2.330413
H  0.720151 -2.13057 -1.927121
H  1.486449 0.195606 1.838576
H  -0.284214 -3.57618 2.762875
H  3.505656 2.625591 -2.05036
H  1.059316 -4.534553 -1.257072
H  3.606769 1.470679 2.138424
H  0.546869 -5.264576 1.095608
H  4.63799 2.688988 0.194099
