program: Gaussian 09
title: 000146457
version: EM64L-G09RevD.01
frameworkgroup: C1[X(C18H18O2)]
method: RPBEPBE
basis: SDD
operation: Freq
keyword: #pfreq=noraman
keyword: PBEPBE/SDD
title: #p freq=noraman PBEPBE/SDD
converged: YES YES NO NO
title: Mulliken charges:
elementType: O O C C C C C C C C C C C C C C C C C C H H H H H H H H H H H H H H H H H H
charge: -0.435661 -0.432520 -0.398838 0.155529 0.381562 0.168142 0.156555 -0.550740 -0.711121 0.319077 -0.631588 -0.399439 0.290687 -0.380794 -0.695352 -0.372649 -0.371489 -0.416605 -0.378796 0.278174 0.227338 0.218820 0.245161 0.213674 0.233974 0.240207 0.233388 0.244405 0.248196 0.220372 0.232141 0.218348 0.230041 0.245586 0.217968 0.250603 0.351720 0.353923
chargesum: 0.00000
title: Mulliken charges with hydrogens summed into heavy atoms:
elementType: O O C C C C C C C C C C C C C C C C C C
charge: -0.083941 -0.078597 -0.171500 0.155529 0.381562 0.168142 0.156555 -0.086759 -0.023265 0.319077 -0.398200 -0.155033 0.290687 -0.132598 -0.024492 -0.142608 -0.125903 -0.198638 -0.128194 0.278174
polarizability: 3.67464641e+02 1.22742002e+01 2.05121710e+02 -2.16896187e+00 5.22889480e+00 1.07155730e+02
1716.lowfreq: -8.9757 -0.0004 0.0005 0.0006 3.5378 7.8895 39.3780 52.0428 68.3552
frequency: 39.3639 52.0233 68.3488 87.4200 95.3863 115.3650 131.7140 181.5376 189.2250 216.6888 226.1394 237.2475 244.1590 290.3743 308.5755 327.1083 335.9023 355.5626 363.5778 375.7970 402.6167 414.5650 442.9329 470.6536 480.0071 515.5444 550.6363 568.6719 589.6820 629.0155 636.9741 655.7745 679.9735 730.6815 735.8174 761.2546 762.4780 800.2722 806.0766 826.5506 829.9284 842.6984 848.6226 888.2432 929.1982 935.7578 946.5849 961.4545 969.5641 997.1710 1007.4317 1045.4534 1052.3399 1063.6448 1092.2189 1097.0399 1119.6934 1129.0328 1132.5383 1144.4923 1161.7268 1185.2751 1210.7423 1225.3216 1245.5890 1250.8134 1261.4562 1286.3793 1303.0901 1308.7042 1315.4904 1353.4853 1378.4638 1389.0271 1391.7464 1417.2921 1427.2095 1444.9972 1470.5531 1472.6136 1474.8721 1479.5846 1480.5392 1492.0716 1501.2290 1580.4139 1592.5523 1603.8140 1620.7364 1625.5832 2952.7119 2976.7795 2979.2394 2983.2629 3041.2741 3074.0922 3078.4964 3082.2909 3089.3140 3101.4909 3109.7755 3133.7552 3143.6183 3153.5906 3169.9184 3174.9994 3582.0496 3582.6702
redmass: 5.3676 3.5746 4.9629 3.6088 3.2720 3.4797 4.5297 3.9608 1.1054 3.8330 3.2981 2.8062 1.4338 2.4272 4.4253 4.1025 1.1603 1.1184 4.0636 4.2080 3.8616 3.0083 3.1043 4.4923 5.4353 2.8881 4.3443 3.8902 4.2564 4.6077 6.5270 3.3451 4.0454 4.4279 3.5327 2.9222 2.3983 2.7100 1.4213 1.5326 2.0546 1.6440 1.5241 2.9717 1.3824 2.5406 1.3500 1.3793 2.2996 2.6444 2.1859 1.9843 2.3200 1.6565 1.7788 1.9334 1.6054 1.8362 1.7755 1.3559 1.2287 1.1437 1.6862 1.7806 1.4259 2.3106 1.4543 3.2314 1.7455 1.6282 1.4077 3.2117 3.9279 1.2082 1.3123 4.2585 3.5168 3.7243 2.2087 1.0687 1.2193 1.0713 1.0988 1.1584 2.4651 6.2340 7.9272 7.4442 6.5952 6.7755 1.0810 1.0642 1.0352 1.0347 1.0958 1.1004 1.0999 1.1001 1.1008 1.0914 1.0883 1.0893 1.0946 1.0874 1.0952 1.0965 1.0660 1.0660
irintensity: 0.2448 0.8656 0.0543 1.4405 0.2128 0.0836 0.2161 0.4602 0.2018 1.9925 0.6505 0.3855 0.3629 0.5078 2.2068 6.3253 133.1866 146.5977 1.5618 1.4856 11.7344 0.6364 21.3590 10.2704 29.5591 16.9062 5.1152 8.8420 5.5362 7.2111 0.2787 6.2663 4.3951 9.5939 0.3853 7.6461 7.0942 13.7295 29.7085 37.3389 20.3045 25.3135 32.9043 14.1199 1.6602 17.4430 0.1463 0.1954 1.2406 2.3712 0.0845 17.6291 2.9771 9.5526 8.9058 39.5442 61.8944 189.0768 130.9296 183.8644 77.9525 7.8813 4.2737 16.5022 4.2683 45.2800 0.6319 9.1491 7.6421 27.3265 1.7840 9.1166 27.8464 10.4827 19.2286 3.6448 6.5043 73.1705 49.5616 11.7342 16.1015 4.5863 9.1293 23.5392 139.4352 1.6153 34.9611 4.6497 10.9124 94.5681 14.1462 32.8795 36.7558 32.2834 6.3948 50.5800 24.0304 42.5108 22.6725 24.2401 27.7404 10.7995 16.5333 7.2152 13.5068 7.3665 79.7019 36.0518
temp: 298.150 k
press: 1.00000 atm
elementType: 8 8 6 6 6 6 6 6 6 6 6 6 6 6 6 6 6 6 6 6 1 1 1 1 1 1 1 1 1 1 1 1 1 1 1 1 1 1
symmnumber: 1
zpe: 808050.6 jmol-1
zpe.correction: 0.307770 hartree
zpe.thermalcorrener: 0.326130 hartree
zpe.thermalcorrenthalpy: 0.327074 hartree
zpe.thermalcorrgfe: 0.261980 hartree
zpe.sumelectzpe: -845.737073 hartree
zpe.sumelectthermal: -845.718713 hartree
zpe.sumelectthermalent: -845.717769 hartree
zpe.sumelectthermalfe: -845.782862 hartree
dipole: -1.0809 -2.7273 -0.3329
dipole: 2.9525
quadrupole: -122.9639 -98.0382 -122.5138
quadrupole: 3.4856 5.3866 2.3321
quadrupole: -8.4586 16.4671 -8.0085 3.4856 5.3866 2.3321
hfenergy: -846.0448429 hartree
pointgroup: C01 [X(C18H18O2)]
dipole: -0.4062861 -1.0265289 -0.3612556 debye
polarizability: 367.0115144|14.9214469|198.8592805|2.0912379|25.3944058|113.8712861 unknown
InChI: InChI=1S/C18H18O2/c1-3-15-16-9-8-14(20)10-17(16)11(2)18(15)12-4-6-13(19)7-5-12/h4-11,19-20H,3H2,1-2H3
charge 0 multiplicity 1
38 atoms
O  5.652441 -1.090633 -0.262282
O  -6.087432 -0.461984 -0.226451
C  0.536325 -1.276113 -0.23305
C  -0.361755 -0.026782 -0.123912
C  1.939638 -0.689387 -0.191868
C  0.422748 1.116226 -0.031637
C  1.846629 0.726867 -0.068031
C  -0.004154 2.565893 0.039933
C  0.277486 -2.321475 0.885376
C  -1.83164 -0.139027 -0.149735
C  3.18419 -1.333384 -0.259089
C  3.024642 1.510885 -0.020714
C  4.357892 -0.534693 -0.203231
C  4.282518 0.874556 -0.088156
C  0.118647 3.172671 1.465904
C  -2.465639 -1.181656 -0.88821
C  -2.685505 0.754529 0.567786
C  -3.867601 -1.313803 -0.936268
C  -4.08598 0.635495 0.530059
C  -4.682258 -0.397455 -0.228817
H  0.375077 -1.771172 -1.215176
H  0.635254 3.157561 -0.645962
H  -1.041025 2.67994 -0.323529
H  0.945153 -3.194975 0.770802
H  0.459878 -1.873963 1.878248
H  -0.767046 -2.678586 0.854811
H  3.257224 -2.425387 -0.355335
H  2.97567 2.602104 0.065031
H  5.215694 1.444502 -0.052435
H  -0.163362 4.241514 1.462414
H  1.152781 3.090998 1.845562
H  -0.53667 2.646422 2.183874
H  -1.853296 -1.889739 -1.457321
H  -2.243356 1.531217 1.198116
H  -4.321856 -2.121947 -1.52489
H  -4.730092 1.320136 1.089886
H  5.606359 -2.076024 -0.33516
H  -6.406279 -1.21733 -0.78014
