program: Gaussian 09
title: 000146445
version: EM64L-G09RevD.01
frameworkgroup: C1[X(C20H32N4O)]
method: RPBEPBE
basis: SDD
operation: Freq
keyword: #p
keyword: freq=noraman
keyword: PBEPBE/SDD
title: #p freq=noraman PBEPBE/SDD
converged: NO YES NO NO
title: Mulliken charges:
elementType: O N N N N C C C C C C C C C C C C C C C C C C C C H H H H H H H H H H H H H H H H H H H H H H H H H H H H H H H H
charge: -0.433907 -0.187728 -0.169407 -0.633417 -0.634233 -0.141053 0.433163 -0.128935 -0.091710 0.241895 -0.529709 -0.534187 -0.234832 -0.546222 -0.476407 -0.473719 0.522804 -0.642118 -0.869721 -0.500874 -0.821895 -0.559992 -0.627422 0.178116 0.262981 0.216249 0.224452 0.196980 0.196129 0.220821 0.215459 0.224035 0.243685 0.215184 0.224675 0.216785 0.212029 0.207042 0.223919 0.211031 0.223642 0.223369 0.230001 0.239645 0.210363 0.205326 0.214925 0.221131 0.235674 0.255670 0.222072 0.238793 0.328806 0.332708 0.307796 0.298635 0.361499
chargesum: 0.00000
title: Mulliken charges with hydrogens summed into heavy atoms:
elementType: O N N N N C C C C C C C C C C C C C C C C C C C C
charge: -0.105101 -0.187728 -0.169407 0.007087 0.025901 0.075196 0.433163 0.095517 0.105269 0.241895 -0.112760 -0.094693 0.008853 -0.106363 -0.047593 -0.042758 0.522804 -0.207445 -0.176705 -0.085186 -0.150166 -0.082250 -0.388630 0.178116 0.262981
polarizability: 4.34960712e+02 -1.24888877e+01 2.19431289e+02 -2.99176148e+01 -2.19589637e+00 1.75971779e+02
1716.lowfreq: -149.7289 -19.8422 -5.7933 -0.0008 -0.0004 0.0007 3.9474 16.9501 40.8263
frequency: -149.7289 16.7618 40.6641 60.9321 64.3640 77.8699 97.1990 109.5226 131.1510 155.7980 165.6674 177.2891 202.5205 204.9323 216.7479 234.0508 248.2637 256.8253 263.3646 282.8539 288.2405 292.3087 312.9674 330.8189 340.9401 358.9389 368.2904 383.5986 398.0020 415.5258 430.9437 437.3992 452.4328 454.7220 486.8349 489.5021 507.2878 527.8055 537.3949 544.3461 574.0007 584.3495 601.3508 617.8438 648.0903 662.4644 695.5699 709.6104 730.0790 739.4297 793.1638 805.5186 821.6785 827.5764 838.6563 857.5218 887.4918 900.4469 912.2253 918.4036 929.2454 940.0316 952.3948 956.7630 967.6807 986.0837 994.2631 1000.3424 1006.2896 1018.4730 1027.8822 1030.5845 1034.5038 1042.0905 1044.8389 1067.9606 1077.8105 1084.6188 1112.5957 1114.3291 1121.6419 1129.3165 1130.0936 1133.5982 1157.1260 1165.2791 1189.0955 1189.7245 1193.9207 1204.3585 1211.5522 1230.3303 1238.7118 1243.9929 1247.3817 1264.5198 1270.0693 1281.2506 1286.8663 1292.1775 1299.5263 1301.7003 1318.7753 1320.6895 1326.2190 1330.0345 1334.5624 1340.0902 1346.0563 1350.0365 1358.7829 1367.6837 1380.4905 1386.2960 1388.4962 1456.3200 1457.3775 1459.0335 1463.7229 1463.9695 1465.2462 1472.7241 1478.0300 1480.2356 1484.4912 1488.2873 1490.6591 1499.5258 1512.9595 1567.3284 1580.7600 1621.3874 1630.2227 2906.7819 2913.6128 2932.9503 2952.1892 2958.7405 2963.4173 2967.7917 2972.5747 2976.2688 2979.9576 2982.6181 2990.4263 2998.1228 3022.0559 3023.9153 3025.9427 3028.3925 3033.9389 3047.0975 3047.3508 3056.0753 3057.6226 3072.1606 3072.5201 3076.0280 3086.6913 3107.2988 3463.9846 3552.7312 3566.7696 3683.0820 3722.0115
redmass: 1.3098 4.9769 3.4170 4.5742 3.4866 3.8128 3.6058 2.3684 3.9897 1.9860 1.9453 3.9438 2.4762 2.1775 1.5888 2.1766 1.9269 2.8406 2.1517 3.1088 2.5494 3.5023 2.6705 1.1253 2.7769 1.2378 2.2839 2.5525 2.7555 4.3846 2.6729 3.9446 3.1739 2.7691 1.3552 1.9485 3.3322 2.9801 2.5269 3.6195 3.7273 3.2514 3.1659 3.2759 2.9896 3.2571 3.6820 2.3295 1.4384 2.6377 2.4437 2.1799 1.6291 1.8927 2.4192 2.3512 1.7702 1.5738 1.9355 1.9962 3.0992 1.9805 1.9088 2.1614 2.1480 2.8582 1.9251 1.9217 2.1121 1.9758 1.8430 2.2463 2.2540 2.0229 2.1627 2.3010 2.3734 1.5131 2.5947 1.8417 2.1145 2.1647 1.6392 1.9728 1.6736 1.8744 1.7268 1.6997 1.4948 2.1029 1.4908 1.3273 1.4537 1.5291 1.4608 1.3785 1.6947 1.4197 1.3615 1.4002 1.5054 1.6425 1.4066 1.5410 1.4063 1.3696 1.4859 1.5156 1.4204 1.5284 1.5740 2.6774 1.2173 1.2290 1.2400 1.0818 1.0734 1.0863 1.0850 1.0887 1.0877 1.0835 1.0827 1.0581 1.1135 1.6910 1.0709 1.0590 3.7761 3.4775 2.1201 1.5704 7.5687 1.0809 1.0800 1.0670 1.0782 1.0621 1.0657 1.0663 1.0625 1.0385 1.0371 1.0631 1.0611 1.0651 1.0878 1.0922 1.0951 1.1011 1.0991 1.1001 1.0994 1.0921 1.0985 1.1004 1.0988 1.0986 1.0953 1.0902 1.0504 1.0655 1.0450 1.0975 1.1049
irintensity: 4.1285 0.7332 0.3156 3.1737 0.6975 3.1942 1.4302 2.6092 1.2607 4.0749 2.6260 0.1559 8.1839 0.9056 0.4749 5.1708 8.2096 6.8486 2.0158 1.1651 0.6962 3.7111 6.2886 118.9640 7.7974 450.5813 7.3651 1.9265 1.3501 0.7491 1.1895 0.6127 7.5639 4.3084 24.6185 8.3844 2.9460 1.4265 4.5518 4.6482 2.4570 3.6742 16.0059 3.0749 12.4103 8.0301 4.1751 0.1697 102.1209 5.0587 7.9060 0.7912 3.9230 3.6503 2.9218 37.1845 8.6328 13.2646 7.9130 38.9577 55.2460 4.7187 7.5549 14.7027 1.2762 16.7236 20.9203 6.3399 55.4229 8.4602 30.0009 11.9823 19.0567 1.1550 9.0078 20.0069 1.5037 5.7727 18.0621 10.1191 28.1754 78.3920 6.2914 4.9446 3.3336 23.2583 4.6796 3.2522 15.3394 3.8419 1.4901 5.6809 8.7355 7.8190 0.4064 2.6221 3.7077 4.6641 1.4784 0.7021 4.7102 5.9146 7.5951 1.3579 2.0547 1.2249 6.3726 1.6805 13.2052 8.7953 31.8906 5.6455 29.7189 4.6145 39.9618 12.9199 2.1792 37.4270 0.0443 7.6017 9.5530 9.2636 5.6137 4.4831 7.8032 8.7113 7.8525 4.9516 454.2611 92.5691 724.2802 722.7301 91.6153 5.0978 17.1438 34.3926 13.2914 35.3451 55.6563 18.1870 36.3446 27.2684 24.0136 41.6060 26.0217 43.0965 15.8080 60.5693 15.6912 49.0731 83.7967 43.7782 9.6159 12.3608 36.0289 61.4517 44.7133 47.4340 29.9587 17.6469 41.1436 7.0568 102.8959 81.8861 39.8488
temp: 298.150 k
press: 1.00000 atm
elementType: 8 7 7 7 7 6 6 6 6 6 6 6 6 6 6 6 6 6 6 6 6 6 6 6 6 1 1 1 1 1 1 1 1 1 1 1 1 1 1 1 1 1 1 1 1 1 1 1 1 1 1 1 1 1 1 1 1
symmnumber: 1
zpe: 1301077.5 jmol-1
zpe.correction: 0.495554 hartree
zpe.thermalcorrener: 0.519801 hartree
zpe.thermalcorrenthalpy: 0.520745 hartree
zpe.thermalcorrgfe: 0.443251 hartree
zpe.sumelectzpe: -1073.605237 hartree
zpe.sumelectthermal: -1073.580990 hartree
zpe.sumelectthermalent: -1073.580046 hartree
zpe.sumelectthermalfe: -1073.657540 hartree
dipole: 3.9084 1.4800 0.6335
dipole: 4.2270
quadrupole: -109.6260 -148.2683 -153.9246
quadrupole: -8.6256 -19.8026 -4.0857
quadrupole: 27.6470 -10.9954 -16.6516 -8.6256 -19.8026 -4.0857
hfenergy: -1074.100791 hartree
pointgroup: C01 [X(C20H32N4O1)]
dipole: 1.5375761 0.6135079 0.1584755 debye
polarizability: 434.6176666|-15.9693312|218.0112731|-29.7969033|-7.8051113|177.7348398 unknown
InChI: InChI=1S/C20H32N4O/c1-19-9-7-13(23-24-18(21)22)11-12(19)3-4-14-15-5-6-17(25)20(15,2)10-8-16(14)19/h11,14-17,25H,3-10,21-22H2,1-2H3
charge 0 multiplicity 1
57 atoms
O  -6.395033 -1.456237 -0.686536
N  4.547189 0.410653 -0.293447
N  5.454667 -0.678786 -0.211105
N  7.690561 -1.233795 -0.584722
N  6.971974 0.997351 -1.009725
C  -3.26063 0.612068 -0.523987
C  -4.020439 -0.678569 -0.091224
C  -1.945292 0.844034 0.24838
C  -1.015237 -0.397845 0.04162
C  0.389583 -0.263008 0.763258
C  -3.102266 -1.890438 -0.364689
C  -1.741954 -1.735852 0.367955
C  -5.27572 -0.562609 -1.012127
C  -4.353244 1.715458 -0.528396
C  -1.230827 2.131426 -0.222613
C  -5.649628 0.95902 -0.976856
C  1.013383 1.097772 0.399015
C  0.12075 2.320763 0.504151
C  -4.47538 -0.662043 1.39195
C  1.316285 -1.414653 0.257324
C  0.251977 -0.342784 2.316775
C  2.815731 -1.215546 0.566741
C  2.335946 1.228981 0.053731
C  3.299658 0.135294 0.074625
C  6.682273 -0.286142 -0.602338
H  -2.968403 0.446882 -1.588177
H  -2.17648 0.956941 1.329795
H  -0.785552 -0.41438 -1.050073
H  -2.921514 -1.965427 -1.457912
H  -3.593311 -2.833871 -0.055617
H  -1.907977 -1.818807 1.459263
H  -1.093308 -2.58642 0.088426
H  -5.00117 -0.874296 -2.036729
H  -4.103219 2.547581 -1.209501
H  -4.472567 2.149269 0.482992
H  -1.877061 3.013084 -0.044465
H  -1.056481 2.069198 -1.317231
H  -6.479823 1.122936 -0.261683
H  -6.012919 1.297397 -1.962618
H  -0.093688 2.529531 1.575708
H  0.651791 3.209067 0.113096
H  -5.162081 0.177111 1.612353
H  -4.996025 -1.607181 1.635773
H  -3.623521 -0.571772 2.085855
H  1.195019 -1.499738 -0.842178
H  0.98525 -2.375952 0.694143
H  -0.439622 0.423651 2.710376
H  -0.119631 -1.333621 2.635265
H  1.233077 -0.180588 2.797464
H  3.429338 -2.010626 0.108199
H  3.001679 -1.284306 1.658631
H  2.732873 2.216503 -0.217628
H  -6.80453 -1.148328 0.161771
H  7.435357 -2.167711 -0.27476
H  8.644425 -1.029908 -0.863386
H  7.889748 1.314508 -1.302268
H  6.156395 1.617959 -0.988146
