program: Gaussian 09
title: 000146372
version: EM64L-G09RevD.01
frameworkgroup: C1[X(C16H15N3O)]
method: RPBEPBE
basis: SDD
operation: Freq
keyword: #p
keyword: freq=noraman
keyword: PBEPBE/SDD
title: #p freq=noraman PBEPBE/SDD
converged: YES YES NO NO
title: Mulliken charges:
elementType: O N N N C C C C C C C C C C C C C C C C H H H H H H H H H H H H H H H
charge: -0.323095 -0.302427 -0.103225 -0.633846 -0.260217 -0.532519 0.359292 0.345316 0.183147 0.176396 0.170733 -0.375047 -0.569419 0.485268 -0.363390 -0.367287 -0.263255 -0.416092 -0.212763 -0.815291 0.283351 0.228819 0.219519 0.239073 0.284362 0.253669 0.256361 0.229210 0.235934 0.337036 0.334655 0.231827 0.222090 0.223575 0.238239
chargesum: 0.00000
title: Mulliken charges with hydrogens summed into heavy atoms:
elementType: O N N N C C C C C C C C C C C C C C C C
charge: -0.323095 -0.302427 -0.103225 0.037846 0.023134 -0.084182 0.359292 0.345316 0.183147 0.176396 0.170733 -0.135974 -0.285056 0.485268 -0.109721 -0.110925 -0.034045 -0.180158 0.019063 -0.131386
polarizability: 2.69101998e+02 -1.48992032e+01 2.09925649e+02 -1.39513715e+00 -4.86580946e+00 1.15323988e+02
1716.lowfreq: -31.3407 -11.4280 -5.8226 -2.3608 -0.0005 0.0004 0.0005 35.7969 62.3982
frequency: -31.2649 35.6047 62.3504 86.3088 116.3753 139.2349 159.9357 193.0231 241.7650 256.0342 276.2169 306.3761 325.8347 342.0696 354.8275 384.3169 400.9593 420.4252 447.2739 466.3407 490.3440 503.7534 517.0104 546.3979 579.9469 589.4896 608.3127 650.1795 667.7602 689.0591 696.7926 711.2898 732.5690 761.2042 768.4577 807.6714 814.1743 833.9556 867.1064 871.8240 898.6301 922.9473 942.7458 944.7670 976.1041 981.8611 985.9485 1005.2911 1014.0882 1040.3525 1046.3038 1069.1934 1085.7060 1115.4509 1125.2080 1153.5721 1166.5803 1168.5032 1191.7599 1204.2819 1218.1478 1252.5048 1273.5351 1278.1869 1287.4875 1320.1142 1331.5882 1366.8446 1382.4106 1398.2775 1412.6422 1420.9126 1437.7577 1470.2066 1473.5040 1476.1912 1489.8144 1499.9959 1579.1719 1585.2818 1589.0896 1607.9219 1618.1336 1641.1034 2975.3854 2977.7270 3026.6417 3056.2043 3072.4651 3084.3798 3133.9888 3136.2752 3142.3409 3148.6218 3162.6605 3166.5878 3173.7485 3545.6792 3692.4671
redmass: 1.0151 5.0793 4.7596 4.2099 3.8239 4.5457 4.8205 5.6881 4.5383 4.3751 4.7751 3.4371 3.7808 4.3778 4.3114 2.2835 1.5356 3.5525 3.5464 2.6805 4.2737 1.3035 4.0668 3.8111 4.1887 4.5966 5.0205 7.2810 8.1261 5.1753 4.6359 4.3414 4.1265 1.7478 2.6475 3.3794 1.4840 3.5482 2.4692 2.9961 1.3009 2.6657 1.4518 1.3679 2.5329 1.3212 1.7324 2.4369 2.2793 1.9442 1.5612 3.7208 2.8854 1.8588 2.1726 1.5056 1.6511 1.1528 1.5035 1.8317 2.8841 1.6788 1.5303 1.5613 1.4062 1.5224 2.4686 7.9857 6.9034 1.2215 3.6682 3.8626 2.4794 2.0464 1.0548 1.2592 1.1651 3.3716 3.8142 2.9526 2.7249 6.9347 6.7009 3.0402 1.0386 1.0711 1.0851 1.0953 1.0931 1.0996 1.0855 1.0889 1.0911 1.0902 1.0946 1.0958 1.0998 1.0450 1.1039
irintensity: 0.5332 1.3826 0.3037 0.8978 0.2504 0.5161 1.6784 5.5335 5.1470 1.8196 0.6507 1.8905 2.2602 0.9812 3.7863 36.7261 53.9473 10.0871 3.2180 7.1347 7.8493 159.5835 9.6632 4.9241 1.4227 3.4948 8.3453 17.8176 12.5953 0.6110 20.3605 2.1675 2.6197 47.3225 24.1182 4.1344 46.0048 14.2652 11.4469 9.7319 9.0594 26.1569 4.7005 5.7314 12.2702 0.1567 1.9786 5.8610 8.5491 7.3072 20.0657 29.7685 27.3526 25.7311 18.9511 7.3131 11.8565 4.0358 44.4276 52.3245 145.6086 33.0837 39.0855 5.9428 16.7307 32.4400 47.4045 40.7935 5.6303 10.3764 88.4614 137.3036 82.6845 49.1284 13.5682 26.7766 2.6657 324.0304 71.9422 3.2839 36.7682 12.9936 45.7436 337.7419 45.9441 69.7611 23.3412 22.0219 32.1685 18.7474 1.4129 13.1521 3.2987 14.8888 16.1587 8.9654 14.6191 42.0032 47.9417
temp: 298.150 k
press: 1.00000 atm
elementType: 8 7 7 7 6 6 6 6 6 6 6 6 6 6 6 6 6 6 6 6 1 1 1 1 1 1 1 1 1 1 1 1 1 1 1
symmnumber: 1
zpe: 727735.4 jmol-1
zpe.correction: 0.277180 hartree
zpe.thermalcorrener: 0.292790 hartree
zpe.thermalcorrenthalpy: 0.293735 hartree
zpe.thermalcorrgfe: 0.234729 hartree
zpe.sumelectzpe: -856.764618 hartree
zpe.sumelectthermal: -856.749007 hartree
zpe.sumelectthermalent: -856.748063 hartree
zpe.sumelectthermalfe: -856.807068 hartree
dipole: 1.3027 -0.8913 1.4644
dipole: 2.1531
quadrupole: -101.5069 -119.2309 -113.2668
quadrupole: 4.1749 2.0532 0.1314
quadrupole: 9.8279 -7.8960 -1.9319 4.1749 2.0532 0.1314
hfenergy: -857.0417977 hartree
pointgroup: C01 [X(C16H15N3O1)]
dipole: -0.5140704 0.3483527 0.576179 debye
polarizability: 269.7476283|-13.514251|209.4264358|-0.1452624|3.5428304|115.1775715 unknown
InChI: InChI=1S/C16H15N3O/c1-10-6-7-15-12(8-10)19-13(9-18-16(19)17)11-4-2-3-5-14(11)20-15/h2-8,13H,9,17H2,1H3
charge 0 multiplicity 1
35 atoms
O  0.253803 1.81321 -0.711808
N  -0.226601 -1.109748 -0.224174
N  0.911675 -3.119004 -0.002882
N  -0.885793 -2.687484 1.511195
C  0.999981 -0.923375 -1.070202
C  1.46666 -2.406562 -1.197107
C  1.95256 0.042217 -0.367028
C  -1.253665 -0.146456 -0.121412
C  -0.066132 -2.351713 0.449339
C  1.500548 1.373848 -0.182941
C  -1.002673 1.243024 -0.350189
C  3.231088 -0.294805 0.131867
C  -2.59754 -0.538035 0.14977
C  -3.659315 0.391822 0.222212
C  -2.060508 2.17173 -0.306442
C  2.304925 2.359396 0.421238
C  4.046041 0.675287 0.761079
C  -3.376083 1.761105 -0.011981
C  3.588142 2.005619 0.894815
C  -5.080865 -0.078476 0.483397
H  0.702875 -0.498847 -2.046181
H  1.061199 -2.856093 -2.125824
H  2.562842 -2.510297 -1.23412
H  3.598917 -1.320571 0.033632
H  -2.812702 -1.606144 0.260752
H  -1.819739 3.222935 -0.491673
H  1.916822 3.378096 0.513411
H  5.033483 0.393029 1.141256
H  -4.180363 2.503609 0.032272
H  -1.388392 -1.96809 2.025926
H  -0.692508 -3.577708 1.963819
H  4.220039 2.762695 1.371611
H  -5.106889 -0.945853 1.166631
H  -5.693928 0.724481 0.928871
H  -5.577403 -0.387543 -0.456931
