program: Gaussian 09
title: 000146351
version: EM64L-G09RevD.01
frameworkgroup: C1[X(C14H10I2O7S)]
method: RPBEPBE
basis: SDD
operation: Freq
keyword: #p
keyword: freq=noraman
keyword: PBEPBE/SDD
title: #p freq=noraman PBEPBE/SDD
converged: YES YES NO NO
title: Mulliken charges:
elementType: I I S O O O O O O O C C C C C C C C C C C C C C H H H H H H H H H H
charge: 0.153403 0.210923 1.080510 -0.265782 -0.335684 -0.408276 -0.221470 -0.566715 -0.477609 -0.500440 0.496794 0.478339 -0.642801 -0.376013 -0.318306 -0.550251 -0.339058 0.363707 -0.248921 -0.347421 0.383687 -0.522636 -0.224699 0.206389 0.271068 0.268853 0.258412 0.264813 0.280919 0.299919 0.275032 0.279144 0.384861 0.389307
chargesum: 0.00000
title: Mulliken charges with hydrogens summed into heavy atoms:
elementType: I I S O O O O O O O C C C C C C C C C C C C C C
charge: 0.153403 0.210923 1.080510 -0.265782 -0.335684 -0.023415 -0.221470 -0.177408 -0.477609 -0.500440 0.496794 0.478339 -0.102880 -0.117601 -0.053493 -0.550251 -0.058139 0.363707 0.050999 -0.072389 0.383687 -0.522636 0.054445 0.206389
polarizability: 5.65524939e+02 5.15722078e+00 2.83922930e+02 3.89346926e+01 -1.33272171e+00 1.81382871e+02
1716.lowfreq: -2.7212 -0.8683 -0.0010 0.0003 0.0009 4.3336 11.5215 13.3293 18.0194
frequency: 11.4527 13.2819 18.0030 19.8461 21.1694 25.8611 29.2877 38.7793 74.5355 89.4279 93.5584 109.2625 121.4912 146.7496 153.3191 167.3894 189.1619 205.4804 219.5798 231.1834 261.9045 273.5979 284.2987 309.2062 331.3831 343.8982 361.4362 388.7790 390.9892 422.8889 441.0939 448.7666 482.5977 493.9214 511.8913 531.4595 537.5130 564.9463 586.1311 624.3162 642.6838 650.2095 671.7405 701.9532 726.3693 759.3356 799.7897 818.5565 823.7509 830.3624 846.5271 869.5138 882.8649 883.7517 891.2849 911.6942 945.4827 957.9777 964.4416 1000.0628 1022.9417 1049.7150 1075.7691 1119.9791 1145.8980 1176.7013 1183.4997 1203.7322 1216.8353 1254.5128 1257.5331 1266.3080 1299.5237 1326.7783 1338.4733 1374.1194 1394.0367 1410.3944 1442.7679 1444.8305 1467.3711 1496.3184 1568.2488 1584.0147 1603.6324 1671.0182 2981.9641 3076.5640 3151.4489 3152.7049 3170.2009 3171.5200 3178.0861 3189.4379 3447.6971 3513.5080
redmass: 13.7462 14.6111 11.9989 9.5449 16.4901 12.4887 7.4551 14.3432 9.1539 14.9668 8.2267 5.6375 6.8753 4.7233 5.6708 9.4041 7.6593 8.9226 8.5723 9.2154 7.9134 7.2691 5.3139 6.2062 4.2020 1.4408 6.3835 8.2739 6.3044 4.4797 3.5386 4.1777 2.9858 4.4625 7.4744 5.3540 6.4778 3.7492 4.0650 5.5505 4.9926 1.5699 5.2929 4.9119 3.6588 5.7869 2.7808 2.8582 4.4515 2.2330 2.5587 3.5201 3.5579 1.5103 2.0728 13.5887 2.0552 1.3586 1.4394 2.9768 3.5708 2.4837 1.1711 1.3677 1.4670 1.8371 1.3945 1.8567 2.2686 1.6944 1.9413 1.5786 5.3974 3.0098 2.4209 6.7010 2.3386 3.6219 1.1207 4.2707 2.8546 5.5752 7.5054 6.3271 6.6298 8.5812 1.0675 1.0919 1.0901 1.0919 1.0887 1.0925 1.0964 1.0986 1.0653 1.0641
irintensity: 0.5962 0.2247 1.2211 0.6771 1.0306 0.4487 1.0230 2.2801 0.7931 4.0906 17.3085 4.9109 3.6180 2.5494 2.9843 1.0677 29.3916 6.9345 11.1964 24.9488 5.8795 8.5956 9.4230 1.0239 10.1703 69.0022 61.5994 33.9307 2.4471 14.2600 4.2687 5.0865 14.1772 28.8305 169.5546 111.3106 54.8078 13.2541 6.5724 10.5362 15.0563 143.9192 7.4514 3.0652 2.2138 15.7479 11.0442 21.5702 65.6400 77.1599 42.8606 13.6337 60.3904 30.0081 19.6130 52.2214 18.1141 1.4150 2.0794 35.1458 108.2429 428.5668 228.5237 13.4366 8.8010 24.7291 12.2580 370.8919 91.8134 29.9816 140.8250 3.7576 287.9500 2.7816 58.0234 6.3433 22.0126 22.7935 44.8316 198.0499 161.7568 24.9697 16.4601 420.9703 49.2926 175.0985 11.0176 3.8934 8.6058 1.4987 0.4066 0.4961 1.3292 1.7701 102.8888 37.6014
temp: 298.150 k
press: 1.00000 atm
elementType: 53 53 16 8 8 8 8 8 8 8 6 6 6 6 6 6 6 6 6 6 6 6 6 6 1 1 1 1 1 1 1 1 1 1
symmnumber: 1
zpe: 559710.4 jmol-1
zpe.correction: 0.213182 hartree
zpe.thermalcorrener: 0.238701 hartree
zpe.thermalcorrenthalpy: 0.239646 hartree
zpe.thermalcorrgfe: 0.148146 hartree
zpe.sumelectzpe: -1485.201295 hartree
zpe.sumelectthermal: -1485.175776 hartree
zpe.sumelectthermalent: -1485.174832 hartree
zpe.sumelectthermalfe: -1485.266332 hartree
dipole: -11.6598 0.0630 -1.5756
dipole: 11.7660
quadrupole: -208.3881 -160.8845 -177.0402
quadrupole: -21.1522 -20.9438 1.4295
quadrupole: -26.2838 21.2198 5.0641 -21.1522 -20.9438 1.4295
hfenergy: -1485.4144777 hartree
pointgroup: C01 [X(C14H10I2O7S1)]
dipole: -4.4523169 1.1213446 0.5898982 debye
polarizability: 546.0086241|-72.7201583|303.7665404|-36.1903965|4.6052591|181.0555759 unknown
InChI: InChI=1S/C14H9I2O4.HO3S/c15-10-7-9(2-3-12(10)17)20-13-4-1-8(5-11(13)16)6-14(18)19;1-4(2)3/h1-5,7,18H,6H2;1H
charge 0 multiplicity 1
34 atoms
I  -2.340482 3.710082 1.118043
I  2.296023 -2.293075 2.076637
S  5.866941 -1.209879 -0.668354
O  -0.300837 1.855217 -0.552227
O  4.598704 -0.265417 0.991329
O  -6.930304 -2.308776 0.297887
O  -4.697944 -2.870452 -0.005133
O  7.289593 -0.478572 0.258982
O  6.291518 -2.745724 -0.954898
O  5.495944 -0.267677 -1.944859
C  -4.124996 0.005091 -0.559861
C  -1.552109 1.183702 -0.498277
C  -5.520786 -0.593056 -0.600396
C  -3.916425 1.244412 0.093576
C  -3.026358 -0.633767 -1.190714
C  -2.635525 1.838727 0.127026
C  -1.748235 -0.046398 -1.166634
C  0.887139 1.235684 -0.166737
C  0.930653 0.03614 0.599069
C  2.074016 1.919423 -0.556825
C  3.413751 0.188538 0.604671
C  2.176815 -0.486845 0.964432
C  3.309683 1.398711 -0.185299
C  -5.612539 -2.024683 -0.079072
H  -5.897179 -0.623254 -1.644072
H  -6.242247 0.022392 -0.03799
H  -4.754576 1.75068 0.582881
H  -3.167881 -1.594036 -1.693748
H  -0.904475 -0.52452 -1.674645
H  0.004979 -0.458441 0.903197
H  1.983883 2.834046 -1.148553
H  4.243592 1.880955 -0.486841
H  -6.994468 -3.255585 0.600456
H  6.840031 0.096356 0.948152
