program: Gaussian 09
title: 000146408
version: EM64L-G09RevD.01
frameworkgroup: C1[X(C19H31NO3)]
method: RPBEPBE
basis: SDD
operation: Freq
keyword: #p
keyword: freq=noraman
keyword: PBEPBE/SDD
title: #p freq=noraman PBEPBE/SDD
converged: YES YES NO NO
title: Mulliken charges:
elementType: O O O N C C C C C C C C C C C C C C C C C C C H H H H H H H H H H H H H H H H H H H H H H H H H H H H H H H
charge: -0.273455 -0.304958 -0.299892 -0.352406 -0.390110 -0.379738 -0.374678 -0.023374 -0.348915 -0.402817 -0.714090 -0.711409 -0.528049 0.222752 -0.535625 0.551795 -0.509927 -0.461452 0.237786 -0.333352 0.175952 -0.532117 -0.529521 0.202571 0.194851 0.187732 0.186832 0.190830 0.185471 0.194687 0.201325 0.205521 0.181123 0.211948 0.213051 0.212429 0.204739 0.196102 0.223798 0.211324 0.237149 0.227876 0.297104 0.223876 0.265749 0.262888 0.234924 0.249741 0.219977 0.251340 0.234493 0.255272 0.223574 0.229306
chargesum: 0.00000
title: Mulliken charges with hydrogens summed into heavy atoms:
elementType: O O O N C C C C C C C C C C C C C C C C C C C
charge: -0.273455 -0.304958 -0.299892 -0.055302 0.007313 -0.005174 0.001623 0.171312 0.057932 -0.009747 -0.083872 -0.080185 -0.063024 0.222752 -0.046000 0.551795 -0.247039 -0.226528 0.237786 -0.083612 0.175952 0.173693 0.178631
polarizability: 2.39653624e+02 -1.11149812e+01 2.62406158e+02 1.51833527e+01 6.18934126e+00 1.72460401e+02
1716.lowfreq: -7.8682 -5.8015 -2.1362 -0.0005 -0.0003 0.0003 9.1114 15.5594 21.7252
frequency: -2.8368 15.1862 21.4506 29.0773 35.5501 41.0354 55.8913 68.1340 81.6845 92.3138 107.7998 110.8998 123.2072 142.2243 155.6920 166.2546 167.3572 176.7253 188.1896 201.1637 207.7466 222.8750 232.5307 251.9214 262.2131 293.1466 314.0207 330.3931 347.7062 368.8457 384.4993 402.1437 424.5183 454.2782 470.2683 486.2705 497.4159 531.3700 560.8598 582.2710 594.4424 636.8075 655.3324 706.8032 723.2385 727.2898 750.1481 751.6024 800.6648 821.8535 835.4557 848.3199 861.4752 889.7058 901.4041 909.2990 916.5301 940.3314 944.6419 953.4983 954.2081 978.7156 984.4417 1006.3696 1017.2637 1039.2255 1044.1046 1048.6796 1079.6715 1086.3963 1093.1109 1114.3711 1115.9102 1117.8013 1131.1014 1141.2825 1154.0679 1158.2249 1175.4620 1182.3833 1190.3556 1194.0889 1221.7127 1228.2130 1240.9656 1243.6002 1252.4955 1266.4766 1273.9361 1283.0873 1287.7061 1295.5572 1313.0288 1320.7696 1331.1659 1339.1288 1344.1894 1354.8991 1362.1557 1372.8349 1373.1893 1391.1427 1403.5116 1425.0923 1443.1768 1451.1964 1454.1755 1455.6646 1459.5543 1462.3699 1466.8477 1467.9539 1469.0888 1471.4138 1476.6652 1478.1489 1480.2728 1483.5835 1484.9623 1486.6571 1488.8518 1491.5961 1576.1757 1611.6581 1613.6726 2941.1189 2948.1462 2952.5465 2953.9899 2960.7252 2963.1775 2966.7660 2967.7469 2971.0133 2973.6367 2985.1507 2985.3821 2986.4547 2994.8638 3006.5630 3025.5338 3041.8851 3046.8904 3054.0845 3062.6657 3063.9827 3066.9054 3071.0010 3072.2842 3074.6537 3121.8849 3122.2007 3126.3344 3148.1818 3161.9392 3547.3623
redmass: 3.9993 3.4935 3.6705 5.3896 3.9258 4.7020 3.4756 3.1093 3.0558 1.8269 3.2981 2.6492 2.6474 1.8916 2.3634 1.1835 2.3468 1.5333 2.5337 1.1919 2.8252 3.3993 1.1915 4.8208 3.0773 3.3350 2.3792 2.9631 4.4036 2.8308 3.6731 2.3961 3.0206 3.4526 2.6514 3.4362 3.9711 3.9768 4.0737 3.6869 1.3281 3.3739 2.7577 5.8468 1.1410 3.1184 1.2899 3.2699 1.9528 2.0415 1.4851 2.2781 2.1041 4.8675 1.5281 1.1996 1.4559 1.7303 4.6272 1.5845 1.4843 2.4706 3.3981 2.5457 1.7842 1.6457 2.8110 2.8141 2.4644 2.4517 2.8320 1.2766 1.2503 1.7882 2.1990 1.5795 1.3247 1.4858 1.7089 1.8922 1.3920 1.8446 1.2356 1.4282 1.3218 2.1826 2.0084 1.8585 1.2801 1.2340 1.0722 1.1305 1.3365 1.3543 1.4143 1.5058 1.6724 1.6200 1.5906 3.6128 1.2752 1.2184 2.1324 1.1830 1.3636 1.1143 1.0643 1.0674 1.0629 1.0758 1.1008 1.1088 1.1190 1.0712 1.0774 1.1729 1.0606 1.2488 2.1059 1.0605 1.1401 1.2593 7.0333 6.7345 6.5523 1.0609 1.0594 1.0629 1.0773 1.0627 1.0367 1.0342 1.0350 1.0595 1.0310 1.0616 1.0876 1.0760 1.0990 1.0958 1.1035 1.1040 1.0998 1.0985 1.0990 1.1017 1.0998 1.1038 1.0989 1.0964 1.1029 1.1023 1.0890 1.0918 1.0954 1.0773
irintensity: 1.1024 1.5381 1.1366 2.6414 0.4022 4.5641 1.1256 2.6130 4.2925 0.0643 1.0494 6.2656 0.5538 0.0501 2.1334 0.1725 0.3748 0.1395 0.8694 0.3968 7.0311 9.6988 1.0603 9.8314 3.3640 0.9383 1.4592 0.9823 0.3835 1.2458 2.8767 0.4536 1.3624 10.7224 0.6454 6.3488 6.5410 4.7318 13.2847 25.2792 126.1765 2.8426 10.6660 12.0071 6.6103 10.9978 0.9364 9.1846 3.9327 1.0266 38.7598 3.8554 5.6464 21.8256 14.2754 4.3452 3.9688 2.2306 45.7686 12.2109 1.0344 12.6774 36.5072 7.6285 4.9408 1.1236 1.4791 1.4150 0.8716 4.2180 80.7866 22.1387 0.9314 23.3451 1.9493 6.7337 0.3900 10.7413 9.8971 3.3905 5.3727 28.0434 3.9552 27.7989 13.7871 89.5501 52.2975 59.0947 1.6960 3.8306 0.3460 1.2714 1.7211 1.1441 2.4448 1.8458 28.2762 1.5215 0.2919 3.9288 16.9733 12.0636 25.8911 2.9371 18.4733 49.8415 9.8326 5.8378 5.2287 1.2082 11.3789 39.4620 26.3206 8.5971 13.2403 13.4091 14.4244 58.3470 101.2322 19.3406 7.3456 91.6149 6.2012 174.1624 18.8655 9.0878 4.2059 26.2030 4.0437 32.9348 72.7774 41.0865 58.4340 87.7711 69.2741 49.3232 8.8057 21.3322 1.7036 24.5830 6.9436 185.6428 14.5583 7.3192 128.4574 23.0027 36.0604 22.0947 69.8313 25.1453 22.0530 21.6623 11.9340 4.9493 8.5210 8.9850
temp: 298.150 k
press: 1.00000 atm
elementType: 8 8 8 7 6 6 6 6 6 6 6 6 6 6 6 6 6 6 6 6 6 6 6 1 1 1 1 1 1 1 1 1 1 1 1 1 1 1 1 1 1 1 1 1 1 1 1 1 1 1 1 1 1 1
symmnumber: 1
zpe: 1222253.5 jmol-1
zpe.correction: 0.465532 hartree
zpe.thermalcorrener: 0.491763 hartree
zpe.thermalcorrenthalpy: 0.492708 hartree
zpe.thermalcorrgfe: 0.406355 hartree
zpe.sumelectzpe: -1021.215817 hartree
zpe.sumelectthermal: -1021.189585 hartree
zpe.sumelectthermalent: -1021.188641 hartree
zpe.sumelectthermalfe: -1021.274993 hartree
dipole: 1.4305 -1.3040 -3.4555
dipole: 3.9608
quadrupole: -135.4031 -136.8373 -149.8189
quadrupole: 7.0611 9.9548 -16.3589
quadrupole: 5.2834 3.8491 -9.1325 7.0611 9.9548 -16.3589
hfenergy: -1021.6813483 hartree
pointgroup: C01 [X(C19H31N1O3)]
dipole: -0.7925168 0.3309513 -1.300244 debye
polarizability: 239.6469381|-16.4660906|256.9956619|-20.8065126|-12.0885331|177.8775837 unknown
InChI: InChI=1S/C19H31NO3/c1-15(2)9-7-5-6-8-10-19(21)20-14-16-11-12-17(22-3)18(13-16)23-4/h11-13,15,20H,5-10,14H2,1-4H3
charge 0 multiplicity 1
54 atoms
O  2.939201 -3.033893 1.547981
O  0.128516 2.3012 0.855152
O  1.1867 4.171962 -1.128894
N  2.697288 -2.146825 -0.588699
C  -2.943734 -1.501947 0.550736
C  -4.249362 -1.021411 -0.123688
C  -2.066166 -2.362159 -0.387434
C  -5.228997 -0.259258 0.809106
C  -0.749033 -2.8332 0.268098
C  0.10884 -3.714437 -0.667177
C  -6.573105 -0.001389 0.086775
C  -4.630956 1.072029 1.325088
C  1.434131 -4.195379 -0.01995
C  2.408331 -3.08318 0.395452
C  3.623845 -1.021013 -0.368481
C  2.967788 0.339576 -0.571987
C  1.845039 0.716812 0.206727
C  3.462481 1.247104 -1.540023
C  1.231909 1.972194 0.031694
C  2.867878 2.518347 -1.706109
C  1.76356 2.897705 -0.916151
C  -1.143274 2.51528 0.126343
C  1.252938 5.082581 0.039664
H  -2.350596 -0.632899 0.900866
H  -3.195484 -2.091359 1.457282
H  -4.776452 -1.905231 -0.541489
H  -4.000793 -0.371442 -0.990689
H  -1.832156 -1.780731 -1.304513
H  -2.64843 -3.246683 -0.721904
H  -5.429362 -0.908207 1.689031
H  -0.976637 -3.401504 1.193172
H  -0.160103 -1.948899 0.586071
H  0.307915 -3.163745 -1.611728
H  -0.475763 -4.608621 -0.963308
H  -7.03541 -0.947021 -0.253362
H  -7.294224 0.511334 0.750437
H  -6.420067 0.639557 -0.803508
H  -4.39228 1.742515 0.475409
H  -3.704983 0.91175 1.90632
H  -5.350424 1.600302 1.978208
H  1.217062 -4.768653 0.897796
H  1.962365 -4.879161 -0.714894
H  2.21266 -2.203248 -1.486095
H  4.498583 -1.117311 -1.040858
H  3.983215 -1.141977 0.67065
H  1.431141 0.037555 0.960318
H  4.324162 0.967646 -2.158093
H  3.250692 3.237282 -2.43759
H  -1.471866 1.570084 -0.347779
H  -1.033365 3.302644 -0.641137
H  -1.873227 2.81833 0.892052
H  0.758448 4.633734 0.919605
H  2.308117 5.313679 0.279256
H  0.730245 5.998882 -0.274249
