program: Gaussian 09
title: 000146352
version: EM64L-G09RevD.01
frameworkgroup: C1[X(C13H15N3O3S)]
method: RPBEPBE
basis: SDD
operation: Freq
keyword: #p
keyword: freq=noraman
keyword: PBEPBE/SDD
title: #p freq=noraman PBEPBE/SDD
converged: YES YES NO NO
title: Mulliken charges:
elementType: S O O O N N N C C C C C C C C C C C C C H H H H H H H H H H H H H H H
charge: 0.133543 -0.411311 -0.252227 -0.275060 -0.376506 -0.336309 -0.037059 -0.103894 -0.682203 -0.700407 0.179571 0.505524 0.266832 -0.382719 -0.410675 -0.391738 -0.355465 -0.770420 0.396400 -0.263660 0.302936 0.299460 0.308427 0.333854 0.274882 0.299115 0.303297 0.291316 0.224299 0.254980 0.253801 0.256401 0.256597 0.215692 0.392725
chargesum: 0.00000
title: Mulliken charges with hydrogens summed into heavy atoms:
elementType: S O O O N N N C C C C C C C C C C C C C
charge: 0.133543 -0.018586 -0.252227 -0.275060 -0.042652 -0.033012 -0.037059 0.199042 -0.074316 -0.126410 0.179571 0.505524 0.266832 -0.091403 -0.186376 -0.136758 -0.101665 -0.041730 0.396400 -0.263660
polarizability: 2.74301725e+02 -4.43607667e+01 1.86355403e+02 -4.82913494e-01 -5.14511351e+00 1.43887857e+02
1716.lowfreq: -17.6114 -8.8014 -0.0025 -0.0014 0.0007 2.9955 3.5915 21.0154 31.2158
frequency: -17.1577 20.9578 31.1068 40.8011 46.8024 60.0480 61.8380 75.6995 94.7817 106.1859 123.9167 137.4954 160.7735 190.4998 238.0278 245.2859 279.1263 301.8464 341.9192 355.4339 405.9922 409.4834 458.5781 467.6643 491.2631 498.1602 514.4695 520.9108 545.4180 554.9902 559.0208 593.7826 605.4717 611.4600 626.3361 643.4312 658.5584 690.2166 714.2500 733.4251 798.1826 816.9387 826.6872 851.2449 887.6134 937.0896 950.3746 959.1629 980.2731 985.2618 995.4460 999.7401 1043.9199 1082.2594 1099.5140 1132.4949 1137.9310 1189.3328 1192.6423 1218.1422 1227.3183 1236.3540 1245.2304 1256.8684 1285.8061 1304.9716 1318.6560 1323.4981 1327.9704 1370.2866 1390.2252 1434.7265 1440.2968 1449.6622 1459.8170 1462.9603 1479.1255 1491.6589 1524.4672 1575.1111 1609.4760 1626.9513 1650.4321 2167.7649 2953.0281 2999.8679 3043.7644 3057.7432 3099.9587 3104.3776 3124.1000 3132.8991 3141.6368 3149.6421 3161.8564 3168.2145 3515.8401 3540.7777 3577.0841
redmass: 4.7866 7.3368 5.9316 5.1572 5.4128 2.2042 2.0589 3.7931 7.7251 6.5129 9.3990 4.9979 5.9626 5.2224 5.5863 4.1980 3.5356 4.3952 2.9249 3.7874 5.1427 3.0987 2.5027 4.3389 3.2485 3.6755 2.5810 2.0766 3.2971 2.7772 2.7904 3.0987 3.0225 3.4094 4.0389 7.1659 1.5176 4.2495 4.5167 3.7477 3.8927 3.3612 1.3892 1.4944 2.4015 2.0268 3.8135 1.3702 1.3529 2.5592 1.6122 2.9694 1.6527 1.8250 4.0379 1.9807 1.5044 1.5267 1.5510 1.5588 1.3760 1.3017 1.4891 1.3441 1.6485 1.5363 1.2658 1.7077 2.5679 3.1411 1.2296 1.1410 3.1504 1.0453 1.1395 1.2607 1.6821 1.7641 2.6480 3.5252 6.2582 6.1480 8.9607 12.6238 1.0796 1.0359 1.0626 1.0585 1.0978 1.1011 1.0889 1.1070 1.1021 1.0914 1.0959 1.0975 1.0642 1.0759 1.0786
irintensity: 5.4187 0.8368 1.2789 0.4706 2.0228 0.4053 7.1359 7.0359 5.4679 0.4195 3.8212 2.7404 0.6095 7.3639 3.1440 4.7705 7.2655 11.6086 10.0304 0.5220 20.6419 1.4574 21.9178 15.7837 0.5576 16.5770 26.0368 119.3399 20.8982 45.9598 24.9215 15.5760 40.3568 77.8648 48.5013 4.8283 125.2973 13.5107 11.6398 0.8405 8.3892 10.5774 33.2819 72.8806 10.6527 11.6780 22.8531 0.2129 2.1236 72.7427 9.1492 0.5778 11.7899 224.3159 101.7197 18.2374 11.7734 8.3235 62.5988 13.7053 3.8013 69.1574 11.3812 171.0489 42.4924 39.8654 14.0743 18.8798 46.4454 66.9007 72.9261 19.3306 1.2224 15.8155 7.4782 153.4879 191.6555 2.3499 239.7574 20.2092 131.8253 296.6711 311.5133 125.0812 26.1143 9.1375 25.2515 2.9050 6.7608 17.8590 13.0984 0.1582 2.5010 4.9756 6.2977 2.5178 45.1961 30.0790 37.1787
temp: 298.150 k
press: 1.00000 atm
elementType: 16 8 8 8 7 7 7 6 6 6 6 6 6 6 6 6 6 6 6 6 1 1 1 1 1 1 1 1 1 1 1 1 1 1 1
symmnumber: 1
zpe: 698201.1 jmol-1
zpe.correction: 0.265931 hartree
zpe.thermalcorrener: 0.286005 hartree
zpe.thermalcorrenthalpy: 0.286949 hartree
zpe.thermalcorrgfe: 0.214268 hartree
zpe.sumelectzpe: -1290.911668 hartree
zpe.sumelectthermal: -1290.891594 hartree
zpe.sumelectthermalent: -1290.890650 hartree
zpe.sumelectthermalfe: -1290.963330 hartree
dipole: -6.5269 6.5864 2.0729
dipole: 9.5015
quadrupole: -147.0758 -134.5364 -117.7403
quadrupole: 18.8269 -15.3029 -6.9212
quadrupole: -13.9583 -1.4189 15.3772 18.8269 -15.3029 -6.9212
hfenergy: -1291.1775987 hartree
pointgroup: C01 [X(C13H15N3O3S1)]
dipole: -2.4299193 -1.4445849 2.4459212 debye
polarizability: 266.3362268|6.0500546|143.8268414|-50.4425483|-6.8945872|194.3819168 unknown
InChI: InChI=1S/C13H15N3O3S/c1-9(17)16-12(13(18)19)7-20-8-15-11-4-2-10(6-14)3-5-11/h2-5,12,15-16,18H,7-8H2,1H3
charge 0 multiplicity 1
35 atoms
S  -1.447003 0.122573 2.169164
O  -3.539373 -2.066403 -0.527512
O  -1.243673 -1.893947 -0.776157
O  -3.894154 2.506431 -1.181701
N  -3.911211 0.505057 -0.017629
N  1.380058 -0.389288 2.114622
N  5.724489 0.564403 -3.15281
C  -2.56267 0.167497 -0.477156
C  -1.451005 0.800103 0.398043
C  0.104462 -1.048864 2.137642
C  -2.352441 -1.338301 -0.605829
C  2.216607 -0.197595 1.005071
C  -4.506609 1.690013 -0.424924
C  1.952643 -0.762184 -0.279432
C  3.406615 0.573257 1.181449
C  2.85636 -0.56226 -1.335665
C  4.302134 0.771122 0.121991
C  -5.917518 1.938684 0.089812
C  4.043623 0.202987 -1.158444
C  4.959545 0.400407 -2.245833
H  -2.45304 0.614146 -1.490881
H  -0.456778 0.631256 -0.042512
H  -1.632353 1.883553 0.465235
H  -4.4150 -0.167676 0.560523
H  -0.034679 -1.607411 3.078034
H  -0.015247 -1.726255 1.282915
H  1.637425 0.12126 2.961398
H  1.047109 -1.346332 -0.46747
H  3.623869 1.014632 2.162021
H  2.642629 -1.000584 -2.315858
H  5.208262 1.365622 0.275703
H  -5.931237 2.877731 0.669328
H  -6.594379 2.077214 -0.770678
H  -6.304392 1.122202 0.723022
H  -3.34357 -3.036648 -0.637083
