program: Gaussian 09
title: 000146322
version: EM64L-G09RevD.01
frameworkgroup: C1[X(C18H12)]
method: RPBEPBE
basis: SDD
operation: Freq
keyword: #p
keyword: freq=noraman
keyword: PBEPBE/SDD
title: #p freq=noraman PBEPBE/SDD
converged: YES YES NO NO
title: Mulliken charges:
elementType: C C C C C C C C C C C C C C C C C C H H H H H H H H H H H H
charge: 0.010518 -0.013588 0.310387 0.495569 0.493432 0.474553 0.292818 -0.442328 -0.510769 -0.488145 -0.485419 -0.511166 -0.468849 -0.464877 -0.434461 -0.243229 -0.183012 -0.573941 0.221553 0.235371 0.240110 0.237660 0.239705 0.243061 0.241300 0.227118 0.227264 0.202390 0.213387 0.213586
chargesum: 0.00000
title: Mulliken charges with hydrogens summed into heavy atoms:
elementType: C C C C C C C C C C C C C C C C C C
charge: 0.010518 -0.013588 0.310387 0.495569 0.493432 0.474553 0.292818 -0.220775 -0.275398 -0.248035 -0.247760 -0.271461 -0.225788 -0.223576 -0.207343 -0.015965 0.019378 -0.146968
polarizability: 3.77489473e+02 6.23497434e+00 2.21569593e+02 2.59380358e+00 1.01694292e+00 7.39498208e+01
1716.lowfreq: -7.3767 -0.0006 0.0004 0.0004 7.0946 13.6722 49.4043 81.7951 109.0540
frequency: 49.3876 81.7925 109.0538 180.8694 200.6927 215.2305 263.9876 292.8874 331.1208 367.8497 411.8153 416.5260 472.0062 484.6601 490.6531 507.3278 511.4008 539.8655 553.4835 573.6555 607.9007 680.2267 687.8090 691.7602 703.0690 747.7047 758.2370 769.5829 809.4301 815.7083 848.0638 859.5301 863.7550 874.9141 914.9164 925.9351 964.8639 969.6057 975.6025 982.7519 990.7122 992.6029 1031.4607 1047.1620 1094.9806 1114.4464 1157.1524 1177.7381 1190.4605 1200.6011 1229.1951 1250.8240 1252.6460 1258.8000 1315.9486 1338.6173 1362.5623 1390.9774 1409.1841 1423.5699 1428.8409 1433.6484 1446.5567 1467.1980 1492.7940 1512.8035 1544.3237 1591.0542 1602.5398 1611.0269 1628.6009 1637.1079 3099.9402 3120.0648 3120.7038 3122.7394 3125.7701 3127.3610 3131.9348 3145.0277 3153.8582 3156.8573 3165.0648 3205.0653
redmass: 3.0477 2.6884 4.0747 3.9017 3.2742 3.8643 4.4676 3.1199 4.8317 4.7316 3.6006 6.0299 4.8605 3.9032 3.6355 4.2790 4.6077 2.9509 4.9756 2.8395 4.4730 2.9176 6.6792 3.9213 2.7457 2.0416 5.2094 1.3111 4.7407 1.3565 2.6791 2.8699 4.5339 1.7705 1.4579 1.3542 1.4242 3.7419 1.3832 1.3600 1.4204 1.1945 1.5673 3.3302 2.0038 2.3682 1.3506 1.2810 1.3065 1.3235 1.9376 1.6045 2.2052 2.4677 1.5458 2.5671 2.7293 3.2965 2.3752 3.5284 2.8337 2.4177 1.7644 4.6808 4.6523 3.8838 4.8160 6.1784 6.9196 6.3604 4.7688 6.1517 1.0599 1.0863 1.0902 1.0860 1.0876 1.0890 1.0916 1.0982 1.0954 1.0990 1.0938 1.1140
irintensity: 0.1428 0.4529 0.1385 0.3339 1.9863 10.8555 0.0332 0.4093 1.0314 2.1265 0.6604 0.2326 0.0336 2.4371 3.7350 1.9439 2.2540 1.8113 0.8054 2.1056 1.0652 1.3330 0.1872 1.4594 8.6488 22.4722 0.3773 20.1190 6.5235 4.1630 0.9481 0.6111 0.4426 136.5932 1.5209 84.5682 1.3215 1.1868 0.1306 11.0482 1.2807 11.3296 10.6946 3.4801 5.0561 1.4614 1.5223 0.2221 7.0673 15.9949 2.3572 3.8812 1.1428 5.2833 1.2968 2.4952 12.2000 2.6643 2.0371 0.9150 0.4484 1.1884 9.2304 5.0426 1.5476 1.7911 1.6708 2.4376 5.7582 4.0638 17.2001 10.4579 6.5409 1.3477 13.6469 0.3284 7.3695 2.4739 16.3665 34.8769 30.8828 42.9435 22.9915 24.7956
temp: 298.150 k
press: 1.00000 atm
elementType: 6 6 6 6 6 6 6 6 6 6 6 6 6 6 6 6 6 6 1 1 1 1 1 1 1 1 1 1 1 1
symmnumber: 1
zpe: 620898.7 jmol-1
zpe.correction: 0.236488 hartree
zpe.thermalcorrener: 0.249229 hartree
zpe.thermalcorrenthalpy: 0.250173 hartree
zpe.thermalcorrgfe: 0.197525 hartree
zpe.sumelectzpe: -691.959027 hartree
zpe.sumelectthermal: -691.946286 hartree
zpe.sumelectthermalent: -691.945342 hartree
zpe.sumelectthermalfe: -691.997990 hartree
dipole: -0.2413 0.0363 -0.0208
dipole: 0.2449
quadrupole: -89.0302 -88.1484 -112.7135
quadrupole: 0.1666 0.0505 0.7608
quadrupole: 7.6005 8.4823 -16.0828 0.1666 0.0505 0.7608
hfenergy: -692.195515 hartree
pointgroup: C01 [X(C18H12)]
dipole: 0.0946476 0.0149649 0.010042 debye
polarizability: 377.0999878|-5.4266132|220.9267008|11.6249746|-9.7139682|74.9821987 unknown
InChI: InChI=1S/C18H12/c1-2-12-6-7-15-9-8-13-4-3-5-14-10-11-16(12)18(15)17(13)14/h2-11H,1H2
charge 0 multiplicity 1
30 atoms
C  -0.117727 0.313523 -0.031808
C  1.250565 -0.132321 0.016824
C  -1.205325 -0.641068 0.011757
C  -0.3942 1.726112 -0.128889
C  1.553232 -1.539357 0.104607
C  2.332257 0.824303 -0.023015
C  -2.566223 -0.170664 -0.035293
C  -0.860895 -2.047602 0.086139
C  0.453768 -2.475673 0.133065
C  0.703933 2.664364 -0.167478
C  2.017147 2.232667 -0.115951
C  -1.747924 2.157911 -0.177207
C  2.90887 -1.96329 0.154276
C  3.674828 0.358774 0.02947
C  -2.798413 1.231515 -0.127288
C  3.957929 -1.020518 0.117879
C  -3.70685 -1.108382 0.031967
C  -5.000442 -0.842617 -0.308966
H  -1.657427 -2.796706 0.091827
H  0.681857 -3.546759 0.188882
H  0.471907 3.733433 -0.239558
H  2.843131 2.952912 -0.146168
H  -1.964202 3.230826 -0.239952
H  3.132117 -3.034491 0.220887
H  4.493428 1.087439 -0.000064
H  -3.830515 1.596951 -0.131512
H  4.998208 -1.361343 0.157337
H  -3.490622 -2.118618 0.400678
H  -5.777482 -1.606469 -0.200671
H  -5.321129 0.122648 -0.717175
