program: Gaussian 09
title: 000146314
version: EM64L-G09RevD.01
frameworkgroup: C1[X(C7H11N3O4)]
method: RPBEPBE
basis: SDD
operation: Freq
keyword: #p
keyword: freq=noraman
keyword: PBEPBE/SDD
title: #p freq=noraman PBEPBE/SDD
converged: YES YES NO NO
title: Mulliken charges:
elementType: O O O O N N N C C C C C C C H H H H H H H H H H H
charge: -0.444361 -0.226068 -0.287440 -0.272775 -0.376063 -0.647831 -0.625117 -0.097201 -0.391710 0.172475 0.247544 -0.285739 -0.249504 0.229847 0.250246 0.242752 0.262617 0.336434 0.318216 0.288255 0.253784 0.251939 0.392862 0.319293 0.337549
chargesum: 0.00000
title: Mulliken charges with hydrogens summed into heavy atoms:
elementType: O O O O N N N C C C C C C C
charge: -0.051499 -0.226068 -0.287440 -0.272775 -0.039630 -0.041359 0.031724 0.153044 0.113658 0.172475 0.247544 -0.031955 0.002435 0.229847
polarizability: 1.87446301e+02 3.11942335e+00 1.10134138e+02 9.95318567e+00 7.39471782e+00 6.12000283e+01
1716.lowfreq: -14.1701 -4.5337 -0.0013 -0.0013 -0.0009 0.5465 21.1891 38.9148 46.1224
frequency: 20.0275 38.8965 46.1054 53.5042 66.7040 109.5632 152.1349 161.0543 211.7843 226.9912 252.8171 277.4331 295.5051 313.9239 340.6627 417.2933 476.5485 496.9413 500.2551 544.3912 559.0073 575.0480 578.9687 617.7997 643.0896 662.8194 684.6667 701.1545 738.8037 781.2172 887.6661 910.1533 917.9832 990.5956 991.7971 1026.8003 1050.0272 1052.5346 1077.7147 1136.4997 1179.6507 1186.2503 1217.0386 1235.7807 1268.5567 1287.3152 1306.5740 1336.1560 1353.0552 1379.9937 1456.2473 1488.6845 1583.2717 1591.2721 1610.6044 1628.1750 1672.9894 1674.0517 2873.8680 3020.4348 3094.5992 3115.0190 3119.8675 3508.5822 3517.5659 3520.5865 3538.0925 3650.9415 3676.1776
redmass: 5.1397 7.7938 6.2332 7.2269 6.8330 5.0581 5.4389 2.6519 5.3913 1.4014 3.2741 3.4369 5.8112 2.7650 3.5321 3.8087 3.2779 1.2280 1.3279 3.1748 1.5502 2.7279 2.5190 1.8489 1.7510 1.5692 3.2968 3.0430 8.8181 3.3281 3.3754 2.2598 2.4802 1.4818 1.6590 3.1132 2.9327 1.9884 3.8265 1.4489 1.6248 1.6132 1.4009 1.6935 1.6908 1.2194 1.5413 1.5073 3.4927 1.7270 1.1071 1.8751 2.4436 5.9023 1.3052 1.8849 5.7074 4.2449 1.0799 1.0616 1.1030 1.0944 1.0891 1.0457 1.0643 1.0449 1.0775 1.1003 1.1045
irintensity: 0.7282 0.1872 4.1971 10.4464 7.8280 17.4296 3.5579 2.8524 3.5524 19.3294 4.8705 10.7962 1.0352 5.2123 8.9522 19.1184 33.4082 249.5457 97.3889 12.6483 142.0228 58.9865 50.1907 89.1904 26.6428 150.2252 75.3066 6.7546 27.1557 22.9507 0.2482 0.1607 1.1940 32.8275 47.1609 7.2695 250.7365 2.7556 6.8868 6.7587 4.1130 18.0148 78.3947 9.8777 17.4379 0.5508 65.8193 12.0052 317.4491 3.2161 30.5782 343.5726 138.8673 107.5578 188.4328 210.9498 8.9904 179.4685 41.6050 35.1936 4.4463 0.5853 3.2526 16.7211 39.5827 60.8573 67.5270 19.7086 29.3239
temp: 298.150 k
press: 1.00000 atm
elementType: 8 8 8 8 7 7 7 6 6 6 6 6 6 6 1 1 1 1 1 1 1 1 1 1 1
symmnumber: 1
zpe: 500507.3 jmol-1
zpe.correction: 0.190633 hartree
zpe.thermalcorrener: 0.205942 hartree
zpe.thermalcorrenthalpy: 0.206886 hartree
zpe.thermalcorrgfe: 0.145766 hartree
zpe.sumelectzpe: -737.439067 hartree
zpe.sumelectthermal: -737.423758 hartree
zpe.sumelectthermalent: -737.422814 hartree
zpe.sumelectthermalfe: -737.483934 hartree
dipole: -0.5679 -0.1563 -1.0776
dipole: 1.2281
quadrupole: -71.0794 -84.4614 -81.5001
quadrupole: 12.1034 3.3295 4.8931
quadrupole: 7.9342 -5.4478 -2.4865 12.1034 3.3295 4.8931
hfenergy: -737.6297 hartree
pointgroup: C01 [X(C7H11N3O4)]
dipole: -0.2196664 0.0523609 0.4271488 debye
dipolederiv: -0.7779053 -0.3728105 -0.1339743 -0.4098843 -0.7402722 -0.1506656 -0.1926883 -0.126386 -0.4624608 -1.1289444 0.0488089 -0.1392528 0.3126334 -0.599997 -0.0047598 -0.0427777 -0.0775743 -0.3224324 -0.7578161 -0.0422359 0.0328365 0.1651122 -0.9162099 -0.0994319 0.0956881 -0.1093087 -0.391353 -0.7427943 -0.0807949 0.0409195 -0.0834113 -0.9519261 -0.1121527 0.0522111 -0.1010475 -0.4049626 -1.2802705 0.3102366 0.0622095 0.2241275 -0.4305537 -0.0129239 0.0899068 -0.0810655 -0.5298173 -0.7549806 -0.159227 0.0042125 -0.2921865 -0.4668197 0.13131 -0.0363268 0.1682285 -0.7270248 -1.1571965 0.4443664 0.1534984 0.2627443 -0.4334087 0.0073759 0.1369164 -0.027581 -0.7506123 0.3920191 0.4351179 -0.0077423 0.3251555 0.0982598 -0.0400045 0.1974963 -0.0622556 0.333336 0.5264103 -0.0938799 -0.0112835 0.3829917 0.0387822 -0.0697546 -0.0223024 -0.0692448 0.2497531 1.63731 0.0571061 0.2459583 -0.1352241 1.13642 0.206478 0.1687763 0.292839 0.2639825 1.6251233 -0.2060768 -0.2457854 -0.2507107 1.0239907 0.1583878 -0.3039833 0.2260631 0.288214 -0.2345778 -0.0883983 -0.0001837 -0.1643485 -0.0023633 0.0600452 -0.0085402 0.0420601 -0.1086458 -0.5132541 -0.0950779 0.0283143 -0.2025091 0.0054764 0.0596708 0.0284793 0.0474619 -0.1259832 1.7724413 -0.223832 -0.2989816 0.0790557 1.1118242 0.1732656 -0.276192 0.2138678 0.3489741 -0.0509705 -0.0837229 0.1037426 -0.0292718 -0.0174633 0.0397362 0.1055455 0.0544726 -0.081586 -0.089038 0.0073721 0.0801811 -0.0403815 0.1094206 -0.038336 0.0517445 0.005668 -0.0889733 0.1099698 0.0597934 -0.0131952 -0.0559372 -0.0109521 -0.0007955 -0.0480218 -0.0226394 0.0978038 0.2696857 -0.0700166 0.0465359 -0.2022552 0.1800097 -0.0209373 0.0675297 -0.0323383 0.3384224 0.1696304 0.0085067 -0.0581674 0.0547793 0.2372575 0.0010449 -0.157171 -0.013963 0.3081951 0.1764166 0.0339758 0.0209504 0.0367841 0.1559865 -0.1024061 0.0181801 -0.147513 0.3048605 0.0840087 0.0145496 0.0226764 -0.0019082 -0.0239458 -0.0404642 0.024686 -0.040883 0.155371 0.0849055 0.0028123 0.0196122 -0.0014507 -0.0308829 -0.0420653 0.0177957 -0.0425988 0.1578688 0.182307 0.1430715 -0.009676 0.0812414 0.2275543 -0.0142208 -0.0191406 -0.0080084 0.3858918 0.2419517 -0.0253682 0.0275952 -0.0622324 0.1351343 -0.0426616 0.0166378 -0.0476607 0.3854838 0.2155687 -0.0242764 0.0289996 0.0070861 0.1646784 -0.0457345 0.0355503 -0.0405929 0.3756946 unknown
polarizability: 187.1629163|-4.3879194|109.7539752|-10.647917|9.2137506|61.863576 unknown
InChI: InChI=1S/C7H11N3O4/c8-4(7(13)14)3-10-6(12)2-1-5(9)11/h1-2,4,10,13H,3,8-9H2
charge 0 multiplicity 1
25 atoms
O  2.421736 -1.910381 -0.184454
O  4.619988 -1.371302 0.319532
O  -0.579373 2.106688 0.034209
O  -4.184787 -1.615783 -0.044257
N  0.59393 0.194367 -0.62384
N  4.030318 1.313344 0.492064
N  -5.375452 0.287067 0.565312
C  2.894527 0.402871 0.426439
C  1.894615 0.859559 -0.690392
C  3.432595 -1.008181 0.191977
C  -0.560988 0.862891 -0.240921
C  -1.777601 -0.004851 -0.186741
C  -2.990785 0.5018 0.155177
C  -4.205747 -0.371493 0.210027
H  2.299546 0.34279 1.372029
H  2.368789 0.71315 -1.677362
H  1.711621 1.93822 -0.551752
H  0.579106 -0.818858 -0.763168
H  4.936417 0.880824 0.681695
H  3.861896 2.209919 0.94602
H  -1.701767 -1.074476 -0.426788
H  -3.066758 1.571597 0.392888
H  2.816478 -2.817948 -0.291423
H  -5.396888 1.284974 0.768108
H  -6.239414 -0.251589 0.62012
