program: Gaussian 09
title: 000010064
version: EM64L-G09RevD.01
frameworkgroup: C1[X(C19H21NO4)]
method: RPBEPBE
basis: SDD
operation: Freq
keyword: #p
keyword: freq=noraman
keyword: PBEPBE/SDD
title: #p freq=noraman PBEPBE/SDD
converged: NO YES NO NO
title: Mulliken charges:
elementType: O O O O N C C C C C C C C C C C C C C C C C C C H H H H H H H H H H H H H H H H H H H H H
charge: -0.205667 -0.454329 -0.157843 -0.403763 -0.122049 0.160939 0.176638 -0.171120 -0.296250 -0.435412 -0.023484 -0.524017 -0.589166 -0.377279 0.424681 -0.490547 0.157163 0.113380 -0.426104 -0.440844 0.104539 -0.362290 -0.055175 -0.583444 0.200069 0.275863 0.209755 0.237549 0.214678 0.257053 0.220785 0.223543 0.223908 0.212289 0.239016 0.245456 0.332490 0.208891 0.196058 0.234135 0.214984 0.241569 0.356826 0.218511 0.218017
chargesum: 0.00000
title: Mulliken charges with hydrogens summed into heavy atoms:
elementType: O O O O N C C C C C C C C C C C C C C C C C C C
charge: -0.205667 -0.121839 -0.157843 -0.046937 -0.122049 0.160939 0.176638 0.028949 -0.020387 0.011892 -0.023484 -0.052285 -0.144839 0.058918 0.424681 -0.006075 0.157163 0.113380 -0.021155 -0.206709 0.104539 -0.147307 0.186395 -0.146916
polarizability: 2.52475643e+02 1.47669759e+01 2.12322803e+02 -3.55519931e+00 8.25808312e+00 1.75915347e+02
1716.lowfreq: -3.6701 -0.0006 -0.0005 0.0005 1.7236 12.6227 27.3172 49.6479 67.2293
frequency: 27.2007 49.6389 67.2008 75.1179 82.6078 117.1134 153.4934 168.6884 184.2386 206.9562 239.4811 243.5771 245.1203 259.6124 280.6133 288.6455 291.6278 312.8725 333.0428 336.0408 349.5097 365.0538 391.7616 404.9845 408.3459 438.3350 452.8675 480.7275 500.3812 517.5846 545.8840 558.0079 574.1844 578.4988 592.7129 610.1790 612.9104 657.0691 669.3430 684.9562 736.1342 753.9534 768.2031 780.3712 810.4366 824.4527 845.1198 861.8688 894.9337 897.9596 907.7289 923.7002 931.5821 945.6156 954.0523 960.1648 966.0567 997.9628 1007.7794 1011.1438 1016.5958 1047.6301 1059.7459 1077.8024 1084.9736 1105.0650 1125.9196 1137.2100 1142.0057 1143.5636 1151.8406 1158.4728 1161.8243 1175.1587 1189.3239 1208.3062 1212.6028 1223.5471 1235.1290 1237.0449 1257.6003 1261.7086 1268.6379 1271.3304 1277.6405 1294.2808 1301.5859 1305.6593 1325.6480 1336.3841 1341.2652 1354.8550 1376.2130 1386.1444 1406.5335 1424.8382 1432.2827 1435.8107 1456.3238 1457.1992 1462.4395 1467.9478 1486.9228 1494.0714 1614.7846 1640.7815 1645.7537 1657.1756 2843.8846 2854.2895 2914.5207 2961.3033 2981.5737 2984.5035 2991.7751 3003.6238 3023.6647 3028.6112 3052.5225 3060.1701 3067.8561 3083.7339 3084.7713 3102.6996 3110.6537 3139.8529 3196.4067 3542.6528 3578.9351
redmass: 4.7766 8.5971 3.5732 5.1922 2.3274 4.4723 2.6674 3.4016 3.3464 3.0257 4.2141 3.3728 3.7146 3.3605 1.7595 3.5501 2.3967 1.3360 2.9968 4.1847 4.9860 2.8273 2.9765 2.8291 3.4290 3.5076 5.4161 3.4833 3.3344 3.1960 3.9363 4.1171 3.5406 3.9831 4.4149 4.1354 3.2819 2.4566 3.9324 4.2953 4.2733 3.6532 2.6617 1.7087 2.8416 2.7501 4.9191 2.3437 4.3690 1.3992 1.4712 2.8631 2.8870 1.5433 1.9432 2.4184 2.4114 2.1010 2.3746 1.7718 1.6666 2.4956 2.8704 2.8150 2.3031 2.2876 2.2494 2.1670 2.2631 1.8643 1.9333 1.7650 1.5387 1.8662 1.7123 1.6908 1.3874 1.3894 1.5751 1.4637 1.6409 2.1002 1.6343 1.3262 1.5746 1.6286 1.4579 1.4077 1.3985 1.5636 1.5954 1.5150 1.4940 1.5521 7.1972 1.2110 3.8415 1.0991 1.0905 1.1208 1.0870 1.0999 1.0825 3.5443 8.6915 10.6997 8.2049 4.7356 1.0732 1.0793 1.0700 1.0664 1.0864 1.0639 1.0635 1.0622 1.0881 1.0935 1.0853 1.0967 1.1031 1.0989 1.0601 1.0940 1.0872 1.0953 1.1141 1.0656 1.0661
irintensity: 0.2376 3.4011 0.0338 3.0855 0.3054 0.5915 0.6561 0.0369 2.0962 1.7466 6.7036 6.4405 4.3784 21.3459 54.7833 42.8825 27.0444 107.1188 11.9488 8.5293 3.6128 9.3840 1.4540 5.4066 10.5439 0.2576 0.8080 10.5157 2.9221 1.7389 0.3491 8.7028 2.0998 11.4793 2.4932 1.3576 6.9215 3.0257 6.8951 0.7657 16.0456 22.6944 11.7371 29.8730 4.8824 21.3967 51.7724 21.7290 25.4489 3.4752 10.4767 14.2338 7.4431 39.7471 40.5666 29.4066 13.5869 31.0089 16.3828 57.4008 14.1868 32.7840 27.9443 17.8151 61.5034 13.5590 40.5334 28.5130 10.7571 26.7201 62.7671 52.6729 8.9215 14.0550 10.4412 45.0450 3.5517 6.6813 0.6214 15.7109 56.0659 36.8636 16.9056 0.0781 16.3967 31.7315 31.3110 22.0530 2.3253 3.3266 6.4521 3.5072 5.3296 1.7578 2.6774 16.7511 25.3389 19.2260 6.8062 12.7637 18.3514 8.2161 3.5149 72.3295 17.7715 107.2174 60.2115 7.9358 39.5904 144.5677 88.0021 44.4321 20.6874 40.4626 15.0578 18.7636 30.0835 31.9633 9.9314 19.2203 31.3701 12.5288 13.9463 6.5512 16.6019 19.4312 24.0980 2.3455 42.1543
temp: 298.150 k
press: 1.00000 atm
elementType: 8 8 8 8 7 6 6 6 6 6 6 6 6 6 6 6 6 6 6 6 6 6 6 6 1 1 1 1 1 1 1 1 1 1 1 1 1 1 1 1 1 1 1 1 1
symmnumber: 1
zpe: 951503.7 jmol-1
zpe.correction: 0.362409 hartree
zpe.thermalcorrener: 0.383079 hartree
zpe.thermalcorrenthalpy: 0.384023 hartree
zpe.thermalcorrgfe: 0.314472 hartree
zpe.sumelectzpe: -1090.436832 hartree
zpe.sumelectthermal: -1090.416162 hartree
zpe.sumelectthermalent: -1090.415218 hartree
zpe.sumelectthermalfe: -1090.484769 hartree
dipole: -5.0549 -0.1551 3.7921
dipole: 6.3211
quadrupole: -156.2266 -122.1019 -137.8776
quadrupole: 14.0548 5.1839 0.0445
quadrupole: -17.4912 16.6335 0.8577 14.0548 5.1839 0.0445
hfenergy: -1090.799241 hartree
pointgroup: C01 [X(C19H21N1O4)]
dipole: -1.9221321 -0.6614738 -1.4326689 debye
polarizability: 255.8611625|-6.4151484|210.7333327|6.8267711|-1.0978426|174.119298 unknown
InChI: InChI=1S/C19H21NO4/c1-2-8-20-9-7-18-15-11-3-4-12(21)16(15)24-17(18)13(22)5-6-19(18,23)14(20)10-11/h2-4,14,17,21,23H,1,5-10H2
charge 0 multiplicity 1
45 atoms
O  2.249949 0.686105 1.458678
O  -1.488684 2.498633 -0.547984
O  3.355454 2.425789 -0.457698
O  3.892847 -1.763342 1.565796
N  -2.441683 -0.332436 -0.030971
C  0.080193 0.879727 0.38311
C  -0.694385 1.290153 -0.886459
C  -1.64709 0.086799 -1.217696
C  1.355932 1.693487 0.770708
C  -0.899089 0.765212 1.603652
C  0.749944 -0.461593 0.079029
C  0.257314 1.665266 -2.045621
C  -0.85467 -1.159692 -1.722719
C  -2.364615 0.490046 1.195299
C  0.322437 -1.463301 -0.804867
C  1.220958 2.791984 -1.586013
C  2.106993 2.314039 -0.439802
C  1.949206 -0.533659 0.804383
C  -3.800813 -0.810949 -0.355614
C  1.107879 -2.643054 -0.844947
C  2.724651 -1.709201 0.792135
C  2.267444 -2.768921 -0.040076
C  -4.328207 -1.796288 0.670589
C  -5.555148 -1.735142 1.244549
H  -2.318221 0.432265 -2.045171
H  1.159293 2.482428 1.517297
H  -0.877199 1.714523 2.1696
H  -0.525786 -0.03117 2.270929
H  -0.334809 2.011963 -2.91608
H  0.844428 0.790585 -2.375183
H  -0.489958 -0.993167 -2.758751
H  -1.553906 -2.015359 -1.770379
H  -2.869302 -0.076355 1.999797
H  -2.90364 1.457394 1.080742
H  0.608516 3.645827 -1.232754
H  1.87172 3.137189 -2.40689
H  -2.085805 2.699391 -1.314119
H  -3.749455 -1.325506 -1.337556
H  -4.532078 0.029704 -0.471909
H  0.829509 -3.467457 -1.511354
H  2.854704 -3.696055 -0.085655
H  -3.633158 -2.609451 0.927221
H  4.368076 -2.618472 1.41726
H  -5.894732 -2.495103 1.956903
H  -6.255815 -0.921435 1.016693
