program: Gaussian 09
title: 000146306
version: EM64L-G09RevD.01
frameworkgroup: C1[X(C14H19N)]
method: RPBEPBE
basis: SDD
operation: Freq
keyword: #pfreq=noraman
keyword: PBEPBE/SDD
title: #p freq=noraman PBEPBE/SDD
converged: NO YES NO NO
title: Mulliken charges:
elementType: N C C C C C C C C C C C C C C H H H H H H H H H H H H H H H H H H H
charge: -0.171988 -0.069652 -0.097115 -0.473147 -0.434634 -0.411940 -0.457243 -0.418823 -0.423474 0.448019 -0.372384 -0.367799 -0.242162 -0.244043 -0.273132 0.209686 0.209740 0.197370 0.210052 0.196687 0.195968 0.233482 0.191646 0.203933 0.205691 0.217252 0.204007 0.222837 0.205650 0.232740 0.218550 0.215329 0.215535 0.223362
chargesum: 0.00000
title: Mulliken charges with hydrogens summed into heavy atoms:
elementType: N C C C C C C C C C C C C C C
charge: -0.171988 0.140034 0.112625 -0.065725 -0.041979 0.013188 -0.047619 0.002436 0.005013 0.448019 -0.139644 -0.149248 -0.026833 -0.028508 -0.049770
polarizability: 2.07159701e+02 -4.18050084e+00 1.42271082e+02 7.17883882e+00 1.01168423e+01 1.06888264e+02
1716.lowfreq: -25.5649 -0.0005 -0.0002 0.0005 12.5023 13.0746 50.3185 61.2695 125.5457
frequency: 49.7340 60.8249 125.4891 172.6110 185.3946 240.2699 265.1919 289.1259 341.4443 372.5423 381.1184 412.1842 430.5466 451.7395 492.5238 518.3538 579.1457 613.7109 630.6206 682.9000 687.7751 743.3582 753.1430 775.4761 801.4909 812.0356 829.5759 860.4350 864.2135 865.6049 895.3815 940.7622 952.7754 963.0493 971.7296 974.5754 991.6211 1016.6868 1035.9147 1054.8383 1068.0045 1080.6465 1092.7967 1106.7184 1110.5842 1126.9829 1136.8104 1173.0386 1183.6444 1209.8290 1230.9382 1238.4924 1261.8156 1273.4593 1291.3955 1298.2235 1316.5383 1329.6789 1333.3223 1339.3457 1352.1948 1355.7233 1357.8166 1361.7508 1373.5058 1386.3864 1395.3172 1448.1506 1449.9051 1457.8272 1463.4299 1472.4778 1474.7759 1494.5323 1514.3211 1574.9040 1619.2458 2914.2371 2957.7267 2967.1772 2970.8748 2980.0821 2988.6190 2994.4867 3001.6431 3015.5804 3028.7743 3032.2865 3035.6905 3044.7132 3050.6559 3118.7377 3125.6456 3155.1422 3166.2969 3175.6986
redmass: 3.5317 3.7613 3.1072 3.7028 1.9946 3.0567 2.9827 3.8915 1.9616 2.1325 2.7229 2.9074 3.8068 2.6972 3.0845 2.8286 2.5989 6.2645 5.0375 3.3537 1.8906 2.2127 1.9491 2.2691 1.6249 1.9564 1.4737 1.6376 2.5597 1.5980 2.7197 2.6057 1.3672 1.9379 1.3078 5.3068 2.0543 2.3187 2.1080 2.1179 1.4561 1.9434 1.7082 1.7107 1.3672 1.4409 1.3199 1.0636 1.5219 1.1769 1.4367 1.4012 1.3515 1.2853 1.5998 1.9201 1.5402 1.9695 1.3758 1.4871 1.4405 1.6269 1.4361 1.5799 1.5576 1.7938 1.7047 2.3501 1.1259 1.0845 1.1031 1.0930 1.0969 2.0966 1.1218 5.7418 6.0400 1.0692 1.0640 1.0630 1.0674 1.0649 1.0651 1.0778 1.0825 1.0981 1.0872 1.0955 1.1025 1.1027 1.1014 1.0846 1.0896 1.0938 1.0935 1.0953
irintensity: 0.2026 0.0291 1.6405 0.6381 1.4702 2.2820 1.0454 0.1629 0.8823 0.7682 3.8660 0.1146 1.7443 4.3281 3.6179 10.2495 4.5822 0.4086 5.5549 5.5226 38.2098 1.8525 77.3654 3.3567 1.8439 2.0486 2.0089 11.0468 1.3110 14.8281 9.8263 7.3935 0.0791 9.2470 0.2612 7.7298 2.6853 1.5594 19.4593 9.3888 0.6395 2.5226 0.7148 9.4496 15.5380 9.3671 4.5619 0.3657 0.6962 1.8743 33.5866 33.7172 26.3926 14.1820 8.1217 28.0703 0.6560 57.3720 6.2366 15.5612 0.8935 14.8685 18.7141 5.4709 4.8986 9.3266 15.8114 1.3077 6.7247 5.0750 16.3289 18.3783 23.9914 154.9436 2.9217 11.2932 168.0867 55.7613 21.9445 27.9224 9.6716 34.6980 54.2827 83.5200 94.2782 47.0313 35.7335 24.6584 31.8612 35.6822 99.4728 7.6557 19.0271 47.2831 30.6861 3.7607
temp: 298.150 k
press: 1.00000 atm
elementType: 7 6 6 6 6 6 6 6 6 6 6 6 6 6 6 1 1 1 1 1 1 1 1 1 1 1 1 1 1 1 1 1 1 1
symmnumber: 1
zpe: 786930.5 jmol-1
zpe.correction: 0.299726 hartree
zpe.thermalcorrener: 0.312047 hartree
zpe.thermalcorrenthalpy: 0.312991 hartree
zpe.thermalcorrgfe: 0.261393 hartree
zpe.sumelectzpe: -598.507016 hartree
zpe.sumelectthermal: -598.494696 hartree
zpe.sumelectthermalent: -598.493752 hartree
zpe.sumelectthermalfe: -598.545349 hartree
dipole: -2.6501 0.0559 0.1174
dipole: 2.6532
quadrupole: -90.0902 -85.2815 -93.8621
quadrupole: -0.5509 1.5939 3.1594
quadrupole: -0.3456 4.4631 -4.1175 -0.5509 1.5939 3.1594
hfenergy: -598.8067424 hartree
pointgroup: C01 [X(C14H19N1)]
dipole: 1.0436222 -0.021735 0.0065293 debye
polarizability: 206.5817992|-2.0139045|144.8442481|-11.2123524|-1.738748|104.8930006 unknown
InChI: InChI=1S/C14H19N/c1-2-6-13(7-3-1)15-10-9-12-5-4-8-14(15)11-12/h1-3,6-7,12,14H,4-5,8-11H2
charge 0 multiplicity 1
34 atoms
N  0.104017 -0.235648 -0.463097
C  3.050498 -0.344568 -0.651132
C  0.93514 1.002058 -0.505992
C  2.224598 0.774215 -1.321272
C  3.435352 0.070203 0.796936
C  1.306649 1.523717 0.914561
C  2.214858 -1.642528 -0.78039
C  2.237617 0.538835 1.666912
C  0.762039 -1.548056 -0.250344
C  -1.27236 -0.13679 -0.157453
C  -2.047682 -1.298396 0.166397
C  -1.966161 1.117638 -0.172966
C  -3.432848 -1.208163 0.414062
C  -3.350571 1.190965 0.075796
C  -4.106885 0.032234 0.367254
H  3.991752 -0.499889 -1.216119
H  0.34451 1.774982 -1.028723
H  2.79393 1.723131 -1.354394
H  1.971115 0.495717 -2.362144
H  4.166383 0.902269 0.723763
H  3.960682 -0.765142 1.301576
H  0.386389 1.700487 1.503024
H  1.812077 2.505261 0.799571
H  2.712414 -2.48598 -0.263858
H  2.18222 -1.900422 -1.857439
H  1.647862 -0.333707 2.003503
H  2.619914 1.020615 2.587855
H  0.171314 -2.321853 -0.776907
H  0.733801 -1.819411 0.829123
H  -1.576927 -2.282158 0.230897
H  -1.433387 2.048753 -0.382574
H  -3.987354 -2.123973 0.65212
H  -3.840928 2.171459 0.045595
H  -5.182431 0.096445 0.561357
