program: Gaussian 09
title: 000146337
version: EM64L-G09RevD.01
frameworkgroup: C1[X(C20H27NO)]
method: RPBEPBE
basis: SDD
operation: Freq
keyword: #p
keyword: freq=noraman
keyword: PBEPBE/SDD
title: #p freq=noraman PBEPBE/SDD
converged: YES YES NO NO
title: Mulliken charges:
elementType: O N C C C C C C C C C C C C C C C C C C C C H H H H H H H H H H H H H H H H H H H H H H H H H H H
charge: -0.438152 -0.058075 0.353214 0.174014 -0.529352 -0.562955 -0.534802 -0.502633 -0.512254 -0.446241 0.381114 -0.392938 -0.606729 0.285695 -0.350501 -0.161191 -0.511571 -0.496682 -0.594207 -0.380997 0.255731 -0.392305 0.205986 0.229949 0.215225 0.218728 0.196827 0.209961 0.195737 0.229216 0.193335 0.240413 0.208064 0.229904 0.241033 0.167215 0.216332 0.223264 0.160736 0.212667 0.252399 0.240456 0.219227 0.225017 0.236894 0.220474 0.234176 0.249267 0.349313
chargesum: 0.00000
title: Mulliken charges with hydrogens summed into heavy atoms:
elementType: O N C C C C C C C C C C C C C C C C C C C C
charge: -0.088839 -0.058075 0.353214 0.174014 -0.093416 -0.129002 -0.128013 -0.077680 -0.078506 -0.008274 0.381114 0.015310 -0.167133 0.285695 0.022902 0.091208 -0.051888 -0.034771 -0.373732 -0.146821 0.255731 -0.143038
polarizability: 2.63253433e+02 -1.52751937e+01 1.96729752e+02 -8.18923231e+00 -1.70881224e+01 1.86076070e+02
1716.lowfreq: -17.1338 -5.1353 -0.0011 -0.0009 -0.0005 7.4221 34.9086 45.5228 63.4663
frequency: 34.8463 45.4309 63.4302 75.6452 95.8513 102.5683 131.3036 160.7184 193.9304 215.4429 223.8771 246.8449 252.7973 268.0440 281.6734 325.9442 335.1910 344.8467 351.0697 367.2623 387.4558 396.6072 418.9330 450.2416 454.5411 483.4444 488.1180 526.1385 558.0811 582.5056 599.2395 616.6061 657.9703 674.9555 705.5624 740.4573 756.2352 765.4716 785.3260 791.5138 815.0178 818.5120 821.9152 837.3082 853.3220 857.4293 878.8103 887.6146 905.5630 910.2572 929.6882 945.0414 951.2557 964.0824 979.0906 985.0277 1019.3855 1029.4100 1034.2562 1035.7520 1045.7053 1062.4433 1066.2921 1083.4336 1094.8508 1106.0721 1116.1077 1122.4441 1130.4873 1134.0419 1145.6918 1148.3007 1164.6296 1166.1958 1184.9439 1195.7912 1202.7222 1205.0790 1207.7056 1216.5146 1223.1756 1239.4252 1244.8089 1248.4617 1259.7511 1274.1486 1283.4258 1295.3546 1301.7639 1308.9634 1321.3770 1323.6582 1329.7329 1342.4012 1350.1084 1356.7082 1369.2354 1382.3589 1400.7939 1418.6535 1438.5517 1451.4967 1456.1346 1461.6098 1467.0208 1471.3095 1473.1100 1474.9576 1478.3132 1488.5373 1494.1863 1500.6134 1600.9037 1614.9180 2804.3096 2810.4216 2827.6444 2954.1183 2977.5922 2984.0611 2990.4229 2996.7776 2999.4487 3002.5994 3008.2925 3010.3101 3038.8103 3042.0797 3043.5498 3052.7295 3056.1470 3073.1974 3085.1915 3094.9724 3099.1292 3116.9868 3120.5829 3170.1109 3183.5027 3202.9892 3578.7218
redmass: 4.2751 3.9291 2.6047 3.0016 2.9991 2.8605 3.1436 3.3010 4.0495 2.7597 3.0510 2.8142 3.2534 2.7402 2.6110 2.9245 2.5482 1.1288 2.8653 2.1610 2.2701 3.0877 2.6726 3.3097 2.9896 4.0743 3.4766 3.5865 3.3035 2.5891 3.0640 4.1813 2.5443 4.9499 3.4545 3.0684 2.3211 1.3660 1.6880 1.4951 2.3958 1.4722 1.5085 2.1978 1.6304 2.3329 1.9828 2.0978 2.0100 2.6974 2.0856 2.0791 1.5860 1.7894 2.5559 1.9666 1.9039 2.2350 1.3278 2.0551 2.3244 1.5349 1.8963 2.1393 1.8908 1.2118 1.9079 1.8883 2.2151 1.8983 2.1178 1.7468 1.5104 1.4066 2.3284 1.4941 1.6771 1.6086 1.5122 1.5714 1.5511 1.3589 1.3716 1.7083 1.8792 1.3852 1.5219 1.6185 1.4151 1.3512 1.4704 1.5654 1.4374 1.4282 1.4178 1.4954 1.5722 6.1040 1.6318 3.0279 1.0876 1.0910 1.0962 1.1076 1.2439 1.1514 1.0890 1.0994 1.1037 1.0950 1.1998 2.1383 6.7811 6.5217 1.0716 1.0715 1.0693 1.0648 1.0635 1.0604 1.0624 1.0856 1.0643 1.0817 1.0691 1.0914 1.0999 1.0990 1.0981 1.0882 1.0995 1.1042 1.0515 1.0615 1.0894 1.0894 1.0911 1.0952 1.1165 1.1143 1.0659
irintensity: 0.0737 0.0538 0.0634 0.0867 0.0717 0.8515 0.6095 0.7919 1.4884 0.3658 0.3556 0.5804 1.7424 1.1521 0.3231 0.5123 3.3454 117.5822 13.8276 1.0727 3.6429 11.0339 1.9539 4.8500 10.8492 6.2270 1.7235 5.6217 0.5689 1.0683 1.6304 2.3853 2.4672 1.3424 9.6393 4.2931 4.9365 2.0886 7.1334 2.8541 14.2369 11.1739 20.0986 1.9826 28.5293 5.4264 6.8776 7.2635 2.7100 6.0207 10.3165 13.0402 2.6044 5.3505 7.9362 0.2249 1.6651 9.6816 30.2364 8.2710 3.9991 35.3972 9.7094 17.7511 13.8707 10.7152 17.4373 31.1632 19.5687 184.0612 11.4043 24.6691 23.3951 2.3257 6.4584 1.5838 1.3116 0.8074 8.7043 7.3352 3.0148 4.7024 4.7301 3.7551 4.8969 7.0808 3.8923 7.3650 0.3376 0.8897 13.8434 3.4680 8.5131 5.6012 8.4393 7.4929 16.0074 4.6468 11.3934 38.8543 8.1750 4.9039 5.9446 1.8872 4.4866 4.1357 4.0813 5.8638 15.4166 24.5598 26.5690 55.4378 15.6993 68.2778 48.5783 42.3630 200.8687 31.8829 34.2780 32.9482 25.3261 8.4520 21.1540 88.4135 61.8593 28.6586 32.0761 13.0668 28.8019 29.1837 13.1978 84.0715 26.0761 16.1918 22.0707 15.2966 8.2193 10.7936 0.2014 35.5280 29.6373
temp: 298.150 k
press: 1.00000 atm
elementType: 8 7 6 6 6 6 6 6 6 6 6 6 6 6 6 6 6 6 6 6 6 6 1 1 1 1 1 1 1 1 1 1 1 1 1 1 1 1 1 1 1 1 1 1 1 1 1 1 1
symmnumber: 1
zpe: 1116624.2 jmol-1
zpe.correction: 0.425300 hartree
zpe.thermalcorrener: 0.444901 hartree
zpe.thermalcorrenthalpy: 0.445845 hartree
zpe.thermalcorrgfe: 0.378191 hartree
zpe.sumelectzpe: -906.600788 hartree
zpe.sumelectthermal: -906.581187 hartree
zpe.sumelectthermalent: -906.580242 hartree
zpe.sumelectthermalfe: -906.647897 hartree
dipole: -2.1845 0.3033 1.3417
dipole: 2.5815
quadrupole: -142.7653 -129.1107 -127.7147
quadrupole: 1.9969 1.1253 -5.8900
quadrupole: -9.5684 4.0862 5.4822 1.9969 1.1253 -5.8900
hfenergy: -907.0260873 hartree
pointgroup: C01 [X(C20H27N1O1)]
dipole: -0.8681238 0.1247342 0.5122033 debye
polarizability: 263.4908386|-15.0870373|196.4095137|-6.7535432|-17.4406561|186.1589031 unknown
InChI: InChI=1S/C20H27NO/c22-17-5-4-16-6-9-19-7-1-8-20(19,18(16)12-17)10-11-21(14-19)13-15-2-3-15/h4-5,12,15,22H,1-3,6-11,13-14H2
charge 0 multiplicity 1
49 atoms
O  4.710901 -2.503702 0.704338
N  -2.474643 0.19967 -0.157296
C  -0.248832 1.399857 0.088184
C  0.395578 0.071434 0.647154
C  0.381034 2.537622 0.963206
C  0.48669 0.378286 2.175964
C  -1.785752 1.40699 0.348314
C  -0.476639 -1.18225 0.313033
C  0.006097 1.566323 -1.430131
C  0.953732 1.856365 2.250001
C  1.804795 -0.181481 0.06013
C  -1.983163 -0.996493 0.563377
C  1.504602 1.595279 -1.782645
C  2.299621 0.498291 -1.087607
C  -3.949564 0.349853 -0.126126
C  -4.684047 -0.762296 -0.863494
C  -6.198862 -0.916416 -0.662966
C  -5.241745 -1.984928 -0.113045
C  2.611822 -1.189883 0.65377
C  3.583045 0.155502 -1.590812
C  3.8843 -1.51046 0.138567
C  4.384873 -0.833486 -0.995836
H  -0.386575 3.295377 1.211434
H  1.181437 3.068559 0.418893
H  1.171593 -0.302441 2.71092
H  -0.510554 0.263375 2.640332
H  -1.977567 1.543653 1.446243
H  -2.211673 2.294414 -0.160273
H  -0.111623 -2.050127 0.897077
H  -0.334952 -1.433598 -0.755087
H  -0.474072 2.501796 -1.78188
H  -0.497682 0.735299 -1.95935
H  0.613995 2.352317 3.177012
H  2.058061 1.89846 2.241394
H  -2.525492 -1.883722 0.194462
H  -2.195896 -0.915956 1.663864
H  1.934525 2.58214 -1.510673
H  1.632248 1.507697 -2.879313
H  -4.340645 0.407798 0.926548
H  -4.189651 1.318636 -0.607916
H  -4.300326 -0.942173 -1.874569
H  -6.816688 -1.166395 -1.53008
H  -6.686598 -0.251248 0.057878
H  -5.095224 -2.023722 0.971719
H  -5.213285 -2.960341 -0.607849
H  2.235829 -1.736042 1.529923
H  3.95899 0.682448 -2.476952
H  5.371819 -1.095298 -1.3878
H  4.269265 -2.920784 1.485264
