program: Gaussian 09
title: 000146271
version: EM64L-G09RevD.01
frameworkgroup: C1[X(C6H7N3O)]
method: RPBEPBE
basis: SDD
operation: Freq
keyword: #pfreq=noraman
keyword: PBEPBE/SDD
title: #p freq=noraman PBEPBE/SDD
converged: NO YES NO NO
title: Mulliken charges:
elementType: O N N N C C C C C C H H H H H H H
charge: -0.250715 -0.157684 -0.011219 0.064213 0.455763 -0.285046 -0.280906 -0.673950 -0.332004 -0.323185 0.243542 0.278910 0.251127 0.251130 0.279955 0.243074 0.246994
chargesum: 0.00000
title: Mulliken charges with hydrogens summed into heavy atoms:
elementType: O N N N C C C C C C
charge: -0.250715 -0.157684 -0.011219 0.064213 0.455763 -0.041504 -0.001996 0.108263 -0.088930 -0.076191
polarizability: 1.39419376e+02 -6.55105474e+00 9.51063528e+01 -2.03639372e-02 -9.44759749e-02 4.06458980e+01
1716.lowfreq: -12.1582 -0.0006 -0.0002 0.0009 7.6207 8.7127 41.5005 119.8837 182.4558
frequency: 41.3147 119.8723 182.4440 194.2715 266.8448 334.8298 363.6798 377.1048 402.4409 439.9651 541.3601 653.6873 665.6804 737.2823 789.3422 823.2270 852.9660 866.1026 957.3850 958.3664 979.7506 1054.1148 1055.2260 1089.5091 1103.5621 1167.6834 1223.2127 1302.3973 1321.9205 1334.5867 1378.1429 1409.2679 1417.5616 1470.1160 1472.0679 1485.3723 1556.6912 1578.6360 2991.8131 3086.5373 3104.8443 3134.7823 3142.2476 3176.8622 3204.2372
redmass: 3.6207 5.8021 1.0997 6.0097 6.4976 3.8448 4.0049 3.1998 6.5855 5.0679 3.1468 6.5785 6.8701 3.3853 6.0892 1.4784 3.5536 1.2607 1.3945 7.3059 1.4278 2.7012 3.5757 1.6383 1.3184 1.7265 1.2993 5.7670 2.6319 1.7656 4.1348 1.8008 1.5692 1.3869 1.4945 1.0470 7.6032 5.6168 1.0322 1.1027 1.0997 1.0893 1.0920 1.0948 1.0949
irintensity: 4.3766 0.9459 0.2536 7.2592 1.7077 1.1810 1.8503 1.4592 1.3268 2.0863 18.4939 1.2552 8.0502 0.5699 43.7877 70.9192 224.3092 4.3988 0.7106 9.6551 0.5853 56.2154 49.0702 1.6195 0.0042 17.1551 0.7302 24.6680 5.5675 24.3021 158.2525 0.8189 75.7408 0.6847 76.9549 23.2160 13.2137 123.2261 18.1396 15.9390 1.8876 23.1198 15.3774 9.7826 0.7060
temp: 298.150 k
press: 1.00000 atm
elementType: 8 7 7 7 6 6 6 6 6 6 1 1 1 1 1 1 1
symmnumber: 1
zpe: 333813.8 jmol-1
zpe.correction: 0.127143 hartree
zpe.thermalcorrener: 0.135965 hartree
zpe.thermalcorrenthalpy: 0.136910 hartree
zpe.thermalcorrgfe: 0.092769 hartree
zpe.sumelectzpe: -471.510065 hartree
zpe.sumelectthermal: -471.501243 hartree
zpe.sumelectthermalent: -471.500299 hartree
zpe.sumelectthermalfe: -471.544440 hartree
dipole: 0.4522 3.0584 0.0252
dipole: 3.0918
quadrupole: -76.1633 -49.9806 -59.4458
quadrupole: 5.9762 0.0592 -0.0576
quadrupole: -14.3000 11.8826 2.4174 5.9762 0.0592 -0.0576
hfenergy: -471.6372083 hartree
pointgroup: C01 [X(C6H7N3O1)]
dipole: -0.1513605 -1.2065715 -0.0302019 debye
dipolederiv: -1.4996074 0.5349434 0.1335912 -0.1925401 -0.1893319 0.0169375 0.1075628 -0.0464707 -0.1996505 -1.1102068 0.0752688 0.0896832 0.827156 -0.4575828 -0.0856815 0.1155103 -0.0189905 -0.1195009 -0.460163 -0.0110589 0.0186224 -0.0168402 -0.4257199 -0.0079435 0.0189748 -0.0079122 -0.2449439 1.5329034 -0.7929232 -0.1668367 -0.8365327 0.3869421 0.0883493 -0.1714924 0.0856854 -0.0361365 1.2680142 0.0689915 -0.0985868 0.0796827 0.1121019 -0.0038196 -0.0959081 -0.0040203 0.112452 -0.4650224 0.1088081 0.03297 0.1655516 -0.0541969 -0.0102755 0.0350514 -0.0047285 -0.1506081 -0.3792362 -0.1780069 0.0152413 -0.2318238 -0.1464255 0.018762 0.0141208 0.013577 -0.1082207 -0.0467272 0.142183 0.0287687 0.0981423 0.1291674 -0.0108972 0.0307984 -0.0160239 0.2174319 0.3854274 -0.1462982 -0.0475514 -0.0544361 0.2903222 0.0228755 -0.0441238 0.0306401 -0.0700883 0.2973386 0.1710739 -0.0250699 0.0532831 0.3428967 0.0164494 -0.0312018 0.0054044 -0.0766015 0.0809719 -0.0856638 0.0033225 -0.0714023 -0.0491339 -0.0043371 0.0039551 -0.0032014 0.1665316 0.0845294 0.0731727 0.0115335 0.0451072 0.0478449 -0.0103183 0.0105454 -0.0125175 0.1690058 0.1077536 0.0528541 -0.0992808 0.0067143 -0.0083466 0.0465666 -0.0639287 0.0665205 -0.0168584 0.1327544 0.0321203 0.0731945 -0.006184 0.0001195 -0.0440809 0.0337768 -0.0724629 -0.0526877 -0.0121022 -0.0719501 0.0123733 0.104101 0.1648793 -0.0094081 0.0181725 0.0071404 0.1394947 0.0225972 0.0949966 0.0146172 0.0916333 -0.0574108 -0.0175547 0.0145397 -0.0177442 0.1333602 0.0607751 -0.0685112 0.0034079 -0.0616122 -0.0861257 -0.0056239 0.0036466 -0.0048955 0.1370201 unknown
polarizability: 138.9311031|-5.2094212|94.6967999|-8.7793492|2.9389397|41.543724 unknown
InChI: InChI=1S/C6H7N3O/c1-9(8-10)6-2-4-7-5-3-6/h2-5H,1H3
charge 0 multiplicity 1
17 atoms
O  -3.357986 0.692421 0.432246
N  -1.327239 -0.29292 0.219665
N  2.910616 0.248816 -0.128547
N  -2.102383 0.889357 0.330501
C  0.079531 -0.101651 0.104688
C  0.946103 -1.217596 -0.026488
C  0.657108 1.199032 0.117526
C  -1.952745 -1.625933 0.224243
C  2.335679 -0.988106 -0.138189
C  2.055085 1.311922 -0.000538
H  0.569066 -2.243199 -0.043891
H  0.03244 2.087492 0.216624
H  -1.580877 -2.228853 1.070755
H  -1.75367 -2.155636 -0.723644
H  -3.038311 -1.469247 0.334554
H  3.023565 -1.835211 -0.240433
H  2.525818 2.301211 0.006529
