program: Gaussian 09
title: 000010050
version: EM64L-G09RevD.01
frameworkgroup: C1[X(C10H16O)]
method: RPBEPBE
basis: SDD
operation: Freq
keyword: #pfreq=noraman
keyword: PBEPBE/SDD
title: #p freq=noraman PBEPBE/SDD
converged: YES YES NO NO
title: Mulliken charges:
elementType: O C C C C C C C C C C H H H H H H H H H H H H H H H H
charge: -0.183694 0.333036 0.239312 -0.201644 -0.537992 -0.482190 -0.561589 0.057983 -0.767465 -0.777860 -0.808279 0.247962 0.239133 0.242775 0.235178 0.214486 0.238145 0.262958 0.216917 0.235966 0.215367 0.233826 0.217358 0.216290 0.209700 0.225538 0.238785
chargesum: 0.00000
title: Mulliken charges with hydrogens summed into heavy atoms:
elementType: O C C C C C C C C C C
charge: -0.183694 0.333036 0.239312 0.046318 -0.056084 -0.032526 -0.060487 0.057983 -0.099215 -0.110386 -0.134257
polarizability: 1.06179969e+02 1.43256946e+00 1.01133912e+02 -4.29973406e-01 1.18315199e+00 9.74597110e+01
1716.lowfreq: -14.5081 -0.0006 -0.0004 0.0005 17.5599 21.0343 101.7192 137.5090 146.9014
frequency: 101.6337 137.4535 146.8604 198.3019 207.4074 230.0769 253.6161 287.2075 287.6221 368.3452 382.3811 402.8617 464.0713 505.5603 541.8060 556.7161 594.9272 633.1642 694.3926 743.2750 825.8978 840.5371 857.4307 905.5979 922.6933 938.5681 944.2523 955.7102 990.1918 1012.1744 1025.6964 1038.0678 1076.9408 1089.5217 1121.3280 1149.5701 1167.1306 1191.2141 1197.9861 1220.1767 1236.6424 1239.5990 1265.5262 1291.3090 1299.0528 1316.5697 1380.8979 1388.5224 1401.3394 1432.0183 1459.2212 1462.6558 1467.8012 1475.1726 1478.1730 1489.6783 1492.2121 1506.6134 1661.1033 2975.8715 2979.0865 2981.9389 3002.8117 3009.4578 3017.0655 3054.0829 3057.8176 3058.9135 3064.0731 3065.3771 3074.0959 3077.0113 3078.9027 3080.0360 3091.7720
redmass: 3.8891 1.0975 1.1030 1.8876 1.2844 2.5424 2.4470 2.9350 1.9665 2.4585 2.3833 2.1683 3.3158 2.9144 4.0875 3.6315 2.9268 3.8993 3.0743 2.1642 1.4314 2.7389 2.2680 2.4852 1.6841 2.0565 1.3892 1.9957 1.4322 1.4793 2.0742 2.2977 1.3451 1.4651 1.9595 2.3727 1.7431 1.8770 1.7653 1.7815 1.4927 2.2631 2.1507 1.7079 1.5725 2.6534 1.2037 1.2425 1.1938 1.0828 1.0551 1.0487 1.0556 1.0538 1.0600 1.0616 1.0708 1.0741 11.7245 1.0367 1.0369 1.0365 1.0591 1.0612 1.0626 1.1017 1.0969 1.0950 1.1000 1.0992 1.0998 1.0982 1.1026 1.0989 1.0963
irintensity: 3.7899 0.2213 0.0517 0.1295 0.4334 0.9087 0.8946 2.1478 0.4494 1.0951 0.2580 1.0592 0.4265 4.5327 2.4133 0.9300 1.3332 1.0668 1.1572 11.1023 1.3504 1.7974 1.8493 1.2129 2.7988 4.9494 1.6560 6.9596 0.7966 16.6875 8.6856 28.8562 2.5149 8.2715 3.8984 0.8177 7.5804 1.8626 4.2753 2.8558 3.3911 0.2694 12.7699 2.8132 3.1589 7.8257 16.0555 16.5588 25.9727 20.7716 6.2853 7.6153 11.7325 6.9628 7.8366 0.8338 12.7928 7.4114 193.5404 21.3438 26.4766 41.2791 30.5273 11.7322 45.0285 7.6172 1.9553 19.5876 34.4977 45.1198 12.3896 11.7304 41.1265 72.6484 31.4405
temp: 298.150 k
press: 1.00000 atm
elementType: 8 6 6 6 6 6 6 6 6 6 6 1 1 1 1 1 1 1 1 1 1 1 1 1 1 1 1
symmnumber: 1
zpe: 619789.9 jmol-1
zpe.correction: 0.236066 hartree
zpe.thermalcorrener: 0.247164 hartree
zpe.thermalcorrenthalpy: 0.248108 hartree
zpe.thermalcorrgfe: 0.200795 hartree
zpe.sumelectzpe: -465.017635 hartree
zpe.sumelectthermal: -465.006536 hartree
zpe.sumelectthermalent: -465.005592 hartree
zpe.sumelectthermalfe: -465.052905 hartree
dipole: 3.3400 1.0117 -0.2065
dipole: 3.4959
quadrupole: -78.3971 -66.1648 -65.6013
quadrupole: -2.7072 1.2964 0.4881
quadrupole: -8.3427 3.8896 4.4531 -2.7072 1.2964 0.4881
hfenergy: -465.2537005 hartree
pointgroup: C01 [X(C10H16O1)]
dipole: 1.3062588 -0.4257769 0.0644628 debye
polarizability: 106.1269953|-1.5248934|101.1867052|0.3483841|1.2064349|97.4598914 unknown
InChI: InChI=1S/C10H16O/c1-9(2)7-4-5-10(9,3)8(11)6-7/h7H,4-6H2,1-3H3
charge 0 multiplicity 1
27 atoms
O  -2.585089 0.428157 -0.27236
C  0.98372 0.270562 -0.431823
C  -0.223985 0.557421 0.553924
C  0.618528 -1.25531 -0.605216
C  -0.017302 -0.563277 1.651475
C  0.602544 -1.77244 0.865539
C  -0.862096 -1.200491 -1.072865
C  -1.405442 0.002893 -0.27028
C  0.909974 1.094177 -1.742202
C  2.376599 0.510491 0.193722
C  -0.427808 1.96557 1.102977
H  1.285998 -1.818182 -1.27883
H  -0.969505 -0.818498 2.149651
H  0.664785 -0.180747 2.431934
H  1.620017 -2.009057 1.222049
H  -0.001308 -2.6921 0.963815
H  -1.437455 -2.116276 -0.846887
H  -0.97307 -1.007649 -2.155373
H  1.126624 2.159386 -1.538199
H  -0.076416 1.051974 -2.235894
H  1.666682 0.736016 -2.465526
H  2.519147 0.000277 1.160706
H  2.546041 1.590991 0.3576
H  3.166986 0.152367 -0.493424
H  0.410762 2.264443 1.758521
H  -0.516261 2.707748 0.28913
H  -1.362869 2.018953 1.689135
