program: Gaussian 09
title: 000146270
version: EM64L-G09RevD.01
frameworkgroup: C1[X(C6H7N3O)]
method: RPBEPBE
basis: SDD
operation: Freq
keyword: #pfreq=noraman
keyword: PBEPBE/SDD
title: #p freq=noraman PBEPBE/SDD
converged: NO YES NO NO
title: Mulliken charges:
elementType: O N N N C C C C C C H H H H H H H
charge: -0.259422 -0.130288 -0.050508 0.054886 0.202402 -0.286210 -0.634796 -0.163292 -0.185869 -0.331297 0.283648 0.258376 0.258355 0.259305 0.243968 0.236461 0.244278
chargesum: 0.00000
title: Mulliken charges with hydrogens summed into heavy atoms:
elementType: O N N N C C C C C C
charge: -0.259422 -0.130288 -0.050508 0.054886 0.202402 -0.002561 0.141241 0.080676 0.050592 -0.087019
polarizability: 1.46011412e+02 6.54106427e+00 9.18695128e+01 7.71141558e-04 8.58714975e-03 3.96089992e+01
1716.lowfreq: -14.0047 -5.4403 -3.5338 -0.0008 -0.0007 -0.0006 53.8390 81.0234 121.6371
frequency: 53.6383 80.9486 121.6293 190.9276 254.1906 327.6235 369.6471 409.2510 411.7649 448.9842 526.1833 612.7564 689.1106 743.2526 786.0097 790.3553 884.2595 897.4312 955.0585 959.5661 1003.9045 1035.4044 1062.2540 1088.4442 1106.0080 1164.9595 1180.0761 1291.3140 1321.6917 1330.9798 1368.4409 1406.7121 1423.3652 1452.7576 1463.5183 1468.7172 1563.7387 1581.5841 3011.7555 3111.8681 3124.9951 3137.7329 3149.8498 3175.6621 3200.2688
redmass: 3.3485 1.0951 5.0378 5.6507 6.1652 3.6105 5.6215 3.5114 8.1246 5.3548 3.0041 7.3395 6.0827 2.3597 1.7496 6.0857 3.2099 1.3073 6.4312 1.4353 1.3279 2.6589 4.3485 1.6301 1.3195 1.0884 1.8554 1.6992 3.1404 9.7404 4.5117 1.3828 2.1203 1.8763 1.0470 1.1851 6.3690 5.7871 1.0310 1.1015 1.1027 1.0886 1.0911 1.0987 1.0961
irintensity: 7.0385 0.3337 2.2004 10.6414 0.0387 3.1435 1.1397 5.1728 0.9819 6.9154 5.9237 1.5011 6.4021 19.4655 69.2112 45.4539 185.4748 0.6673 14.4483 1.8253 0.7179 27.9346 131.9859 3.5922 0.0870 0.1430 13.6115 33.5779 2.7624 38.4000 137.4324 69.2973 42.1864 51.9314 20.8763 72.0295 15.4741 74.6461 12.7124 11.5283 2.3338 11.1190 13.5406 20.8958 1.3176
temp: 298.150 k
press: 1.00000 atm
elementType: 8 7 7 7 6 6 6 6 6 6 1 1 1 1 1 1 1
symmnumber: 1
zpe: 333390.8 jmol-1
zpe.correction: 0.126982 hartree
zpe.thermalcorrener: 0.135952 hartree
zpe.thermalcorrenthalpy: 0.136896 hartree
zpe.thermalcorrgfe: 0.092295 hartree
zpe.sumelectzpe: -471.517419 hartree
zpe.sumelectthermal: -471.508449 hartree
zpe.sumelectthermalent: -471.507505 hartree
zpe.sumelectthermalfe: -471.552106 hartree
dipole: 3.7589 0.7509 -0.0007
dipole: 3.8332
quadrupole: -58.9253 -55.4706 -59.4384
quadrupole: -7.9486 0.0012 0.0009
quadrupole: -0.9805 2.4742 -1.4937 -7.9486 0.0012 0.0009
hfenergy: -471.6444011 hartree
pointgroup: C01 [X(C6H7N3O1)]
dipole: -1.4901365 -0.2319465 -0.0002708 debye
dipolederiv: -1.520156 -0.474727 -0.0000287 0.2229306 -0.1922837 0.0000051 -0.0000667 -0.0000418 -0.1968777 -1.2452295 -0.091454 -0.0000167 -0.7935577 -0.3919749 0.0000287 -0.0001284 -0.0001333 -0.1052135 -0.6271709 0.0525518 -0.0000033 -0.2203282 -0.3347655 0.0000306 0.0001225 0.0000482 -0.2085523 1.5959823 0.7350762 0.000082 0.8256785 0.3088518 0.0000352 0.0001337 0.0000488 -0.0673007 1.5111982 -0.0717772 -0.0000245 -0.2627682 0.0766145 -0.0000541 0.0000545 -0.0000222 0.1180511 -0.408099 0.0633785 -0.0000072 0.3790198 -0.0940473 -0.0000286 -0.0000273 -0.0000016 -0.111204 -0.0078004 -0.1356217 0.0000003 -0.080201 0.1086413 -0.0001473 0.0002061 -0.0000007 0.191341 0.2727497 -0.0184256 -0.0000177 -0.0098177 0.2155344 -0.0000751 -0.0000274 -0.0000612 -0.1159816 -0.0704784 0.0334891 -0.0000216 -0.1887624 -0.2937822 0.0000452 0.000028 0.0000254 -0.1344163 0.2518706 -0.0393263 -0.0000146 0.299306 0.3487506 -0.000094 -0.0001295 -0.0000902 -0.0881019 0.0877702 -0.069673 0.0000316 -0.0572954 0.0424475 0.0000353 0.0000222 0.0000285 0.1749595 0.1260876 -0.0284732 -0.079266 -0.000431 0.0262106 -0.0376053 -0.0455541 -0.0643527 -0.0261137 0.126094 -0.028261 0.079026 -0.0002781 0.0261272 0.037601 0.0452317 0.0644578 -0.0265345 -0.0378167 0.0745887 0.0002251 -0.0927594 0.1452185 0.0001294 0.0000899 0.0000051 0.1363659 0.0571449 0.0675872 -0.000007 0.0831568 -0.057093 0.000039 -0.0000134 0.0000387 0.14826 -0.1052379 0.007768 0.0000172 0.0195422 0.0999571 0.0000148 0.0000261 0.0000135 0.1742169 -0.0069088 -0.0767005 0.0000249 -0.1234349 -0.0344069 0.0000402 0.0000322 0.0000377 0.1371018 unknown
polarizability: 146.4711654|4.2050213|91.409759|-0.0011375|-0.0085463|39.6089992 unknown
InChI: InChI=1S/C6H7N3O/c1-9(8-10)6-4-2-3-5-7-6/h2-5H,1H3
charge 0 multiplicity 1
17 atoms
O  3.381394 0.60782 0.000118
N  1.311855 -0.307657 -0.000064
N  -0.864542 -1.196581 0.000273
N  2.123314 0.840555 0.000055
C  -0.097244 -0.072021 -0.000012
C  -0.635844 1.245383 -0.000243
C  1.862283 -1.675849 -0.000119
C  -2.036246 1.376909 -0.000162
C  -2.85411 0.218438 0.000129
C  -2.220219 -1.041302 0.000332
H  0.0270 2.111786 -0.000477
H  1.515378 -2.221927 -0.891618
H  1.517281 -2.221338 0.892502
H  2.959765 -1.578873 -0.001223
H  -2.486947 2.374789 -0.000338
H  -3.945515 0.289544 0.000195
H  -2.802201 -1.969477 0.000552
