program: Gaussian 09
title: 000146266
version: EM64L-G09RevD.01
frameworkgroup: C1[X(C16H16ClNO)]
method: RPBEPBE
basis: SDD
operation: Freq
keyword: #p
keyword: freq=noraman
keyword: PBEPBE/SDD
title: #p freq=noraman PBEPBE/SDD
converged: YES YES NO NO
title: Mulliken charges:
elementType: Cl O N C C C C C C C C C C C C C C C C H H H H H H H H H H H H H H H H
charge: -0.066516 -0.415282 -0.284904 -0.326613 0.476812 -0.517632 0.388040 -0.570309 -0.411478 0.391341 -0.602131 -0.465973 0.407164 -0.391177 -0.374874 -0.345642 -0.233918 -0.245571 -0.248912 0.225148 0.218573 0.210393 0.206105 0.250025 0.193168 0.209542 0.264795 0.269085 0.258769 0.246989 0.256544 0.223104 0.220740 0.225591 0.359004
chargesum: 0.00000
title: Mulliken charges with hydrogens summed into heavy atoms:
elementType: Cl O N C C C C C C C C C C C C C C C C
charge: -0.066516 -0.056278 -0.020109 -0.101465 0.476812 -0.088666 0.388040 -0.114179 -0.008768 0.391341 -0.333046 -0.207204 0.407164 -0.144189 -0.118331 -0.345642 -0.010814 -0.024831 -0.023321
polarizability: 2.50914614e+02 -1.42147230e+01 1.67294514e+02 3.49329224e+00 -2.07127272e+00 1.44017430e+02
1716.lowfreq: -12.6948 -5.0801 0.0022 0.0030 0.0031 11.6059 12.2263 41.8437 52.1332
frequency: 7.9437 41.8193 52.1312 92.6539 130.2335 175.2813 184.3393 202.4359 222.5716 248.4174 263.4103 283.5141 289.5356 336.7503 381.7401 400.0495 401.9947 439.6055 440.2145 448.9864 457.5115 480.1542 519.4875 530.4876 596.9707 616.2018 640.8536 650.9070 698.0905 701.9149 715.0551 732.7244 755.2260 764.4266 837.6493 844.0550 849.5967 867.7520 890.0345 911.3103 916.1301 937.9165 971.9200 990.7632 992.0900 993.4830 1007.0470 1033.0227 1047.2910 1066.5548 1088.3750 1134.5061 1159.0930 1171.4223 1179.3130 1187.4052 1190.7062 1197.8305 1208.6674 1233.1489 1250.0977 1261.0396 1281.5702 1293.3100 1315.6629 1322.0444 1333.9469 1345.6989 1376.3607 1387.6986 1395.9406 1419.6786 1434.0953 1456.0094 1462.1153 1464.4539 1474.1198 1484.1369 1486.5726 1581.0465 1588.1653 1609.9262 1615.4543 2861.4554 2866.9776 2956.8775 2990.5477 3015.3281 3027.7236 3052.2841 3118.2941 3126.8133 3139.9137 3147.1413 3151.5819 3156.5046 3178.0977 3469.1456 3502.9980
redmass: 3.7534 7.3596 5.5022 4.8275 4.5472 3.7405 7.3695 4.3077 3.7367 5.7660 6.1613 4.4283 3.3601 2.1439 5.0010 3.6535 3.4511 2.7501 1.3545 1.8514 3.6912 2.9743 3.0841 2.8910 3.5413 6.3012 2.9642 6.2528 2.6151 2.8184 3.1454 3.3643 2.6150 3.1573 3.1249 1.5689 1.9049 1.4615 1.5878 2.5468 1.6562 2.2140 1.4070 2.8510 2.1851 2.2897 2.5285 2.1113 2.0226 2.2161 1.7140 2.4904 2.1573 1.0515 1.4832 1.5093 1.4989 1.1221 2.8477 1.3444 1.2312 1.6980 2.1750 1.3498 1.3478 1.3913 1.4766 1.3582 7.1326 2.8670 1.6157 3.2596 2.2789 1.1153 1.2686 1.1119 1.1386 2.1593 3.0332 7.0693 6.0221 6.2464 7.0857 1.0721 1.0700 1.0822 1.0603 1.0880 1.0894 1.1012 1.0844 1.0883 1.0939 1.0912 1.0921 1.0991 1.0945 1.0751 1.0649
irintensity: 0.0785 0.0657 0.0531 0.4393 0.4255 1.7964 0.3131 0.4170 1.1794 1.2716 1.7014 1.7773 3.5930 7.2321 7.6392 0.1884 0.7085 12.9590 131.3725 25.6470 6.7314 60.8205 0.8451 35.6444 16.8912 0.6495 21.5696 2.7047 21.9969 34.6371 26.8034 36.0146 20.8119 7.7682 23.0364 0.7608 0.8644 5.5146 18.1135 13.8643 2.6774 21.9884 0.1761 1.4890 20.9571 12.5451 14.9117 5.6463 6.5194 4.4365 2.1444 73.5687 18.5165 0.1008 11.3676 36.3266 97.0251 3.5915 23.4404 4.7909 14.4033 27.4842 7.3964 8.5662 4.5031 6.6961 5.7564 26.1905 0.2931 2.6956 14.2995 2.8196 6.1904 14.2437 5.3133 2.1965 20.8468 27.6839 122.6313 22.1371 0.4528 20.8714 14.7180 51.8352 159.0964 19.7928 15.5304 48.7871 55.7147 23.3507 1.4918 5.0432 33.0421 4.3958 0.6980 37.2439 10.8875 0.2691 63.2108
temp: 298.150 k
press: 1.00000 atm
elementType: 17 8 7 6 6 6 6 6 6 6 6 6 6 6 6 6 6 6 6 1 1 1 1 1 1 1 1 1 1 1 1 1 1 1 1
symmnumber: 1
zpe: 736968.7 jmol-1
zpe.correction: 0.280697 hartree
zpe.thermalcorrener: 0.297014 hartree
zpe.thermalcorrenthalpy: 0.297958 hartree
zpe.thermalcorrgfe: 0.235201 hartree
zpe.sumelectzpe: -1207.961373 hartree
zpe.sumelectthermal: -1207.945056 hartree
zpe.sumelectthermalent: -1207.944111 hartree
zpe.sumelectthermalfe: -1208.006869 hartree
dipole: -1.0333 2.1723 -0.0200
dipole: 2.4056
quadrupole: -116.3570 -110.2345 -118.4044
quadrupole: -4.6042 -1.7808 2.7393
quadrupole: -1.3584 4.7642 -3.4057 -4.6042 -1.7808 2.7393
hfenergy: -1208.2420698 hartree
pointgroup: C01 [X(C16H16Cl1N1O1)]
dipole: 0.3471067 0.8789115 -0.0525757 debye
polarizability: 248.6310357|19.7387177|169.6768644|-3.4840283|-0.0085072|143.9186576 unknown
InChI: InChI=1S/C16H16ClNO/c17-15-8-12-6-7-18-10-14(13(12)9-16(15)19)11-4-2-1-3-5-11/h1-5,8-9,14,18-19H,6-7,10H2
charge 0 multiplicity 1
35 atoms
Cl -4.897009 -0.590573 1.322853
O  -3.770088 -1.834166 -1.26474
N  1.305955 2.70408 -0.503965
C  0.684333 0.309386 -1.192524
C  -0.690058 0.124336 -0.533853
C  0.952894 1.78979 -1.605483
C  -1.042577 0.796173 0.677611
C  -0.095819 1.769931 1.362622
C  0.262761 3.005816 0.494436
C  1.820913 -0.380131 -0.406115
C  -1.622856 -0.739116 -1.148631
C  -2.324832 0.569172 1.232822
C  -2.904483 -0.965675 -0.597284
C  1.586535 -1.65318 0.1794
C  3.127721 0.164708 -0.318497
C  -3.231907 -0.29776 0.602731
C  2.621739 -2.361017 0.82879
C  4.166953 -0.54301 0.327899
C  3.921215 -1.809422 0.904604
H  0.624191 -0.226414 -2.164182
H  1.798973 1.799848 -2.319688
H  0.048759 2.126727 -2.171642
H  -0.56253 2.126839 2.299341
H  0.854205 1.271067 1.633696
H  -0.677521 3.403673 0.036353
H  0.666591 3.793589 1.158017
H  1.767481 3.553437 -0.848684
H  -1.374506 -1.262714 -2.07799
H  -2.616096 1.073034 2.159934
H  0.58347 -2.092513 0.130822
H  3.327312 1.159586 -0.723467
H  2.414083 -3.341633 1.272495
H  5.168122 -0.100098 0.386511
H  4.727033 -2.355715 1.407952
H  -4.628958 -1.903055 -0.76884
