program: Gaussian 09
title: 000146230
version: EM64L-G09RevD.01
frameworkgroup: C1[X(C13H14Cl2O3)]
method: RPBEPBE
basis: SDD
operation: Freq
keyword: #p
keyword: freq=noraman
keyword: PBEPBE/SDD
title: #p freq=noraman PBEPBE/SDD
converged: YES YES NO NO
title: Mulliken charges:
elementType: Cl Cl O O O C C C C C C C C C C C C C H H H H H H H H H H H H H H
charge: -0.043787 -0.048140 -0.245800 -0.455943 -0.219750 0.020735 -0.456523 -0.119282 -0.426906 -0.536052 -0.554046 0.214114 0.629684 -0.329834 -0.403080 -0.213555 -0.226727 -0.103570 0.261953 0.219581 0.239360 0.228607 0.213252 0.240117 0.246349 0.250435 0.277540 0.210250 0.347864 0.244940 0.280288 0.257924
chargesum: 0.00000
title: Mulliken charges with hydrogens summed into heavy atoms:
elementType: Cl Cl O O O C C C C C C C C C C C C C
charge: -0.043787 -0.048140 -0.245800 -0.108079 -0.219750 0.282688 0.002419 0.109325 0.026464 -0.039268 -0.066256 0.214114 0.629684 -0.329834 -0.158140 0.066733 0.031197 -0.103570
polarizability: 2.34187639e+02 -1.97327362e+01 1.56101642e+02 9.76020732e+00 1.02900775e+01 1.09536184e+02
1716.lowfreq: -5.9186 -0.0015 -0.0012 0.0014 2.0815 8.5929 20.5139 23.5207 38.6189
frequency: 20.4419 23.4530 38.5917 67.8245 85.7723 96.1567 119.7051 131.7704 165.5435 180.4351 195.9708 255.1813 265.9315 308.8044 339.3695 348.6415 369.3738 372.0476 405.3131 422.4571 441.5878 459.2502 478.1997 499.2533 520.8470 551.2335 560.8994 641.5236 667.4113 689.8144 725.4444 762.9305 797.0452 813.9783 830.4588 845.3228 866.3402 876.7111 905.3899 926.8092 954.7669 988.5453 1009.5497 1026.1303 1029.5492 1050.2472 1074.8001 1088.9613 1100.3256 1129.7260 1142.6419 1163.7397 1185.9723 1199.9246 1213.3736 1223.1956 1255.9768 1264.0223 1289.5013 1294.4025 1315.0916 1332.3053 1344.3225 1351.6620 1366.5913 1368.5321 1376.1886 1377.8734 1433.0476 1444.1878 1453.3008 1459.3845 1479.3149 1568.3892 1592.8597 1656.0727 2970.8263 2986.7439 2995.7715 3000.5483 3008.8344 3023.2729 3049.9737 3062.3685 3074.0823 3079.3520 3135.8343 3175.9792 3182.9676 3573.1442
redmass: 8.7367 9.0089 6.2181 4.2260 6.2380 7.8589 4.2402 6.3967 6.2415 6.1067 4.3461 3.4050 5.0286 1.1095 4.2166 3.5030 6.3101 3.1936 5.4278 3.1274 3.3837 3.6967 4.3385 4.3198 3.5662 3.8914 3.7788 6.3735 4.7494 5.5456 4.5655 1.8786 2.2980 2.2020 2.0509 2.6344 1.4033 3.7593 2.4395 2.6849 1.3982 1.8897 3.2776 3.2720 3.5077 2.2051 2.0216 2.6162 1.6507 2.2130 1.4521 1.3120 1.3370 1.4210 2.4445 1.2513 1.2300 1.3380 1.2506 1.5253 1.4178 1.2629 1.2831 1.4685 2.6505 2.3535 3.5151 1.7423 1.0880 1.1049 1.1502 2.3636 1.1020 7.7669 7.4950 11.8122 1.0822 1.0601 1.0649 1.0637 1.0662 1.0846 1.0970 1.0969 1.1015 1.1015 1.0898 1.0954 1.0936 1.0664
irintensity: 1.1303 0.4274 1.5910 4.8293 3.2545 0.8569 1.2462 0.3538 0.0578 3.8949 0.7691 0.8666 0.8197 152.2310 9.4416 5.9555 0.7140 4.8969 4.4764 12.8657 3.6692 3.5629 4.5949 4.1729 6.1063 8.9574 15.6497 6.8016 5.9795 22.2291 12.6616 31.5108 8.8459 37.6947 41.9051 6.8660 19.4541 11.4077 5.0584 27.7298 2.0752 21.4136 41.2713 80.8657 101.0368 57.8125 30.5049 29.0028 29.9650 67.4840 13.1136 18.4678 39.0855 140.9448 0.2798 20.8441 5.3417 31.7941 2.3823 18.7680 6.9644 1.8111 4.8619 9.5041 22.2445 17.7247 1.0985 12.8047 7.3812 4.3403 15.2964 114.1654 12.2444 25.5454 25.2774 309.7721 53.7995 10.7412 13.2182 21.9226 31.4669 9.8173 8.6876 14.2374 2.7828 35.1273 8.9687 2.3711 0.8998 5.6118
temp: 298.150 k
press: 1.00000 atm
elementType: 17 17 8 8 8 6 6 6 6 6 6 6 6 6 6 6 6 6 1 1 1 1 1 1 1 1 1 1 1 1 1 1
symmnumber: 1
zpe: 639986.6 jmol-1
zpe.correction: 0.243758 hartree
zpe.thermalcorrener: 0.261292 hartree
zpe.thermalcorrenthalpy: 0.262236 hartree
zpe.thermalcorrgfe: 0.195601 hartree
zpe.sumelectzpe: -1648.233222 hartree
zpe.sumelectthermal: -1648.215688 hartree
zpe.sumelectthermalent: -1648.214744 hartree
zpe.sumelectthermalfe: -1648.281379 hartree
dipole: -2.8965 -4.5674 2.8097
dipole: 6.0947
quadrupole: -110.8207 -125.3954 -119.5548
quadrupole: 11.5542 -14.7299 7.9594
quadrupole: 7.7696 -6.8052 -0.9645 11.5542 -14.7299 7.9594
hfenergy: -1648.4769799 hartree
pointgroup: C01 [X(C13H14Cl2O3)]
dipole: 1.1447194 -1.9211856 -0.8650466 debye
polarizability: 234.1137254|20.6158646|152.8128933|9.2607608|-15.2001233|112.8988462 unknown
InChI: InChI=1S/C13H14Cl2O3/c14-9-3-1-8(12(15)5-9)2-4-11-6-10(16)7-13(17)18-11/h1,3,5,10-11,16H,2,4,6-7H2
charge 0 multiplicity 1
32 atoms
Cl -1.642537 2.320304 -0.839179
Cl -6.479882 -0.352489 -0.484705
O  2.31475 0.731752 0.402436
O  4.43821 -1.893354 0.425789
O  3.939342 2.242299 0.921229
C  1.91557 -0.665311 -0.009225
C  2.787774 -1.188862 -1.157961
C  4.272931 -1.069037 -0.789205
C  0.424629 -0.591603 -0.35367
C  4.632633 0.404785 -0.528302
C  -0.442999 -0.093892 0.835046
C  3.636874 1.18001 0.342371
C  -1.92694 -0.128357 0.518631
C  -2.584834 0.8747 -0.235292
C  -2.733958 -1.212847 0.956348
C  -3.957664 0.832241 -0.550523
C  -4.112108 -1.300799 0.662728
C  -4.702927 -0.269769 -0.091424
H  2.083834 -1.290831 0.887367
H  2.586429 -0.626648 -2.089507
H  2.538609 -2.249891 -1.336881
H  4.909564 -1.469127 -1.605381
H  0.094256 -1.605649 -0.655133
H  0.2813 0.076706 -1.22336
H  4.680882 0.94406 -1.495829
H  5.629482 0.513635 -0.06455
H  -0.116606 0.929034 1.091594
H  -0.244138 -0.733386 1.716159
H  5.375738 -1.840317 0.739206
H  -2.264896 -2.00685 1.548801
H  -4.426159 1.631623 -1.129438
H  -4.709759 -2.145732 1.01526
