program: Gaussian 09
title: 000146248
version: EM64L-G09RevD.01
frameworkgroup: C1[X(C22H20O2)]
method: RPBEPBE
basis: SDD
operation: Freq
keyword: #pfreq=noraman
keyword: PBEPBE/SDD
title: #p freq=noraman PBEPBE/SDD
converged: YES YES NO NO
title: Mulliken charges:
elementType: O O C C C C C C C C C C C C C C C C C C C C C C H H H H H H H H H H H H H H H H H H H H
charge: -0.417944 -0.229578 0.005967 0.287416 0.401883 -0.603874 -0.031252 -0.398742 0.471635 -0.350686 0.487337 0.475596 -0.477821 -0.449931 -0.501825 -0.380786 -0.521195 -0.484171 -0.490102 -0.473031 -0.467678 -0.486939 -0.243809 0.171520 0.222521 0.211901 0.224446 0.217324 0.189673 0.191865 0.234851 0.237534 0.238527 0.220479 0.220690 0.234166 0.237963 0.236574 0.242253 0.240576 0.252349 0.252264 0.226242 0.375812
chargesum: 0.00000
title: Mulliken charges with hydrogens summed into heavy atoms:
elementType: O O C C C C C C C C C C C C C C C C C C C C C C
charge: -0.042132 -0.229578 0.005967 0.287416 0.401883 -0.169452 -0.031252 0.043028 0.471635 0.030851 0.487337 0.475596 -0.242969 -0.212397 -0.263298 0.060382 -0.287028 -0.246208 -0.253528 -0.230778 -0.227102 0.017674 -0.017566 0.171520
polarizability: 3.53137441e+02 -4.69164647e+01 2.85986479e+02 4.82919571e+01 1.20313687e+01 1.49178708e+02
1716.lowfreq: -11.3271 -3.9734 -0.0002 0.0003 0.0006 3.3652 12.9396 16.8282 25.3715
frequency: 12.9155 16.6004 25.3222 50.0543 62.8493 71.3586 103.0143 118.0275 131.3169 139.5874 169.6442 197.9348 220.3645 263.2507 267.0142 285.7847 346.1218 356.3599 402.1786 407.9313 428.8426 461.2940 481.6045 491.4048 500.4388 505.6137 512.2726 519.1811 534.7435 555.0972 577.2381 588.7798 627.6204 638.1497 686.8812 696.2279 707.8282 725.1137 739.2617 752.0972 766.5811 769.6311 808.5656 813.3384 826.3860 840.5812 857.9245 860.1917 874.8534 880.0915 914.1484 936.7564 961.2318 969.0271 973.8413 983.5526 989.1201 993.2829 1033.5118 1037.7208 1047.2098 1076.8628 1079.1505 1093.4862 1108.0018 1112.3606 1127.5500 1155.3180 1172.2421 1182.6829 1193.9775 1218.5648 1220.4662 1229.0617 1244.2792 1250.4785 1252.7382 1258.0035 1271.0599 1287.9591 1291.9324 1295.2405 1327.6224 1338.8904 1353.2592 1372.7127 1379.2657 1390.3443 1408.3806 1426.0373 1430.8350 1436.6518 1436.8030 1462.6663 1463.6921 1469.6203 1479.8808 1490.1349 1494.3148 1513.8297 1549.2912 1594.3790 1604.3009 1611.7137 1636.4760 1669.7821 2950.9897 2973.5457 2982.7848 2987.0256 2994.3932 2997.5915 3019.3275 3030.6142 3047.5247 3064.1752 3116.1539 3119.0179 3121.8746 3123.5164 3131.5707 3140.1175 3144.4762 3155.3688 3156.7674 3513.0953
redmass: 9.9768 6.1497 5.6413 2.2788 2.8627 4.3609 4.4203 2.3807 4.5158 2.0562 6.0831 4.3276 3.8653 4.4335 3.2534 3.8579 4.6642 4.3097 6.4140 3.7421 3.7462 5.8025 3.6959 4.2496 1.7936 3.9342 4.1319 3.6776 5.3263 3.1154 5.8980 4.7745 3.9051 1.3121 6.7581 3.7511 4.2711 1.0954 2.5341 1.2631 2.0448 1.8595 3.8489 1.4768 1.4505 2.0766 4.6830 2.9690 1.9572 3.7037 1.4555 1.4534 1.3955 4.3650 1.3538 1.3888 1.4948 3.8621 2.8890 3.0842 2.6396 2.3411 1.7420 2.8602 2.2482 1.9423 1.3893 1.3565 1.3560 1.4498 1.3248 1.3465 1.3614 1.8716 1.4811 1.6421 1.6340 2.2546 1.2449 1.0671 1.2537 1.3487 1.7508 2.3392 1.5920 1.8457 4.3459 2.2192 2.6250 4.2099 6.1093 2.2378 1.0861 3.6491 1.0748 1.1618 1.1090 1.1145 4.6765 4.1089 4.9481 6.8933 6.9025 6.4817 7.5072 8.2454 1.0589 1.0593 1.0597 1.0611 1.0990 1.0596 1.1004 1.0991 1.1043 1.1033 1.0867 1.0860 1.0863 1.0870 1.0917 1.0969 1.0980 1.0966 1.0978 1.0639
irintensity: 1.1974 0.0510 0.1271 0.1955 0.0754 0.2465 0.7271 0.0232 0.0414 0.3177 2.1194 3.5226 8.9207 0.0174 0.2455 0.7629 4.0846 4.4444 0.0513 0.0772 3.3401 0.1847 17.5539 8.8098 27.2698 1.0010 1.1634 1.5327 3.7280 1.4377 1.8269 14.0680 6.1987 126.5319 0.0981 3.0240 5.8471 14.0138 22.8794 0.9131 3.6296 10.8666 6.0683 1.4632 2.2303 2.1440 2.7376 0.4061 131.2793 17.0373 0.9511 1.0164 0.4231 0.8798 0.2315 2.2254 5.6678 52.2455 223.3088 13.2244 3.8080 17.5068 2.7135 23.6936 3.4502 1.9156 0.8676 1.6995 0.3154 1.2559 20.5477 20.4185 13.5811 0.7178 0.4207 3.6176 18.1764 0.8699 3.9608 0.9775 7.3190 8.5498 17.1139 5.9924 10.7125 34.5771 6.9292 0.1518 1.4951 2.2519 0.2496 7.3946 26.9708 6.4169 0.3577 1.1516 3.8816 20.2846 3.6074 10.7077 0.6050 6.5380 2.0076 8.1827 1.2402 200.5947 26.1691 5.5136 63.1240 5.8092 9.7321 40.8293 0.0933 0.6280 24.9044 75.1038 15.0521 0.9922 0.9287 2.8368 15.9178 25.2670 47.5268 41.1746 31.2708 19.0125
temp: 298.150 k
press: 1.00000 atm
elementType: 8 8 6 6 6 6 6 6 6 6 6 6 6 6 6 6 6 6 6 6 6 6 6 6 1 1 1 1 1 1 1 1 1 1 1 1 1 1 1 1 1 1 1 1
symmnumber: 1
zpe: 937555.9 jmol-1
zpe.correction: 0.357096 hartree
zpe.thermalcorrener: 0.377419 hartree
zpe.thermalcorrenthalpy: 0.378363 hartree
zpe.thermalcorrgfe: 0.304645 hartree
zpe.sumelectzpe: -999.174075 hartree
zpe.sumelectthermal: -999.153752 hartree
zpe.sumelectthermalent: -999.152808 hartree
zpe.sumelectthermalfe: -999.226526 hartree
dipole: -0.6465 0.5119 -1.4469
dipole: 1.6654
quadrupole: -123.8910 -126.7552 -149.8404
quadrupole: -2.9768 12.8476 5.8470
quadrupole: 9.6045 6.7403 -16.3448 -2.9768 12.8476 5.8470
hfenergy: -999.5311711 hartree
pointgroup: C01 [X(C22H20O2)]
dipole: -0.2553901 -0.138114 0.5873835 debye
polarizability: 355.0592631|39.9669559|284.495394|-53.7550069|0.1778118|148.7479697 unknown
InChI: InChI=1S/C22H20O2/c23-20(24)8-3-1-2-5-15-9-10-18-12-11-16-6-4-7-17-13-14-19(15)22(18)21(16)17/h4,6-7,9-14,23H,1-3,5,8H2
charge 0 multiplicity 1
44 atoms
O  -8.565203 1.099494 -0.157947
O  -7.065344 1.128345 -1.929454
C  2.142878 -0.608051 0.128098
C  0.836569 -0.293918 0.663432
C  -0.111165 -1.345794 0.886834
C  -1.513998 -1.073426 1.410103
C  3.106758 0.435847 -0.102754
C  -2.493932 -0.578647 0.307834
C  2.490746 -1.97436 -0.179635
C  -3.916041 -0.321521 0.852954
C  2.777313 1.807438 0.198768
C  4.410454 0.118722 -0.637385
C  0.263478 -2.677007 0.577972
C  0.540632 1.09525 0.956902
C  1.531717 -2.993802 0.054972
C  -4.893015 0.173115 -0.235817
C  1.467129 2.098352 0.736523
C  3.803426 -2.266775 -0.714128
C  4.727045 -1.26208 -0.934867
C  3.741057 2.825652 -0.035396
C  5.3449 1.167068 -0.856851
C  -6.306913 0.416934 0.324737
C  5.011685 2.505479 -0.558098
C  -7.290195 0.906089 -0.720101
H  -1.923428 -2.004077 1.848281
H  -1.493557 -0.328681 2.22995
H  -2.096576 0.347545 -0.15244
H  -2.534978 -1.333597 -0.50239
H  -3.864545 0.42562 1.673287
H  -4.307587 -1.255897 1.307851
H  -0.461139 -3.481084 0.755302
H  -0.440158 1.352327 1.368945
H  1.788905 -4.03514 -0.171972
H  -4.945707 -0.56543 -1.058419
H  -4.510407 1.107169 -0.689538
H  1.22002 3.140927 0.969912
H  4.05072 -3.310394 -0.942025
H  5.718731 -1.494741 -1.340449
H  3.486484 3.866775 0.195168
H  6.333768 0.924356 -1.263329
H  -6.722821 -0.506202 0.774665
H  -6.287885 1.162089 1.144704
H  5.744449 3.300662 -0.733478
H  -9.186869 1.421174 -0.866421
