program: Gaussian 09
title: 000146236
version: EM64L-G09RevD.01
frameworkgroup: C1[X(C13H14N4O4S)]
method: RPBEPBE
basis: SDD
operation: Freq
keyword: #p
keyword: freq=noraman
keyword: PBEPBE/SDD
title: #p freq=noraman PBEPBE/SDD
converged: YES YES NO NO
title: Mulliken charges:
elementType: S O O O O N N N N C C C C C C C C C C C C C H H H H H H H H H H H H H H
charge: 0.992158 -0.465115 -0.548977 -0.242978 -0.237437 -0.651059 -0.431896 -0.446397 -0.077454 -0.084545 -0.146143 -0.233104 0.271501 0.510833 -0.349578 -0.432304 0.429415 -0.423063 -0.789795 0.045418 0.222056 -0.797525 0.333715 0.323955 0.293699 0.326486 0.231395 0.314587 0.313578 0.253085 0.241079 0.260675 0.241028 0.240790 0.274153 0.237763
chargesum: 0.00000
title: Mulliken charges with hydrogens summed into heavy atoms:
elementType: S O O O O N N N N C C C C C C C C C C C C C
charge: 0.992158 -0.465115 -0.548977 -0.242978 -0.237437 -0.317345 -0.117309 -0.132818 -0.077454 -0.084545 0.177812 0.060594 0.271501 0.510833 -0.023092 -0.200909 0.429415 -0.169978 -0.047012 0.045418 0.222056 -0.044819
polarizability: 2.93568147e+02 -2.06164166e+01 2.21496645e+02 1.66238557e+00 -2.97255355e+01 1.50595372e+02
1716.lowfreq: -54.7911 -5.5862 -3.3338 -0.0021 0.0004 0.0005 4.2000 17.4629 29.0784
frequency: -54.7698 17.4334 29.0595 39.8844 54.6566 69.9014 81.2580 94.2518 105.1971 111.4431 135.0262 165.1331 173.5195 179.4483 203.9211 205.3755 216.2871 248.2085 288.4188 306.8439 327.6685 337.3905 356.0362 379.6680 413.8659 415.3661 437.6255 479.6412 497.2423 523.5949 546.1768 549.2640 552.7667 567.8648 582.1816 615.9033 646.7713 648.6256 662.0587 675.2846 687.2986 722.3121 738.5084 809.2876 819.4786 828.6596 858.8212 865.0444 886.5686 928.0344 956.2331 963.5247 976.2744 977.6445 986.6064 992.2499 993.9207 1033.0383 1044.2870 1051.7266 1066.4104 1126.9233 1155.6494 1185.2156 1189.5589 1216.4776 1231.4668 1264.2257 1302.2545 1327.8906 1369.9989 1378.1397 1382.8066 1404.7910 1406.7272 1418.5405 1447.4897 1466.0700 1468.1675 1468.7783 1473.0795 1503.9971 1549.7389 1589.3440 1596.5594 1606.2993 1644.3058 1658.7369 2978.4330 2988.8722 3054.1937 3073.8907 3117.0825 3125.5983 3138.7069 3168.0120 3173.3799 3189.5183 3201.7947 3506.6999 3520.3607 3543.8461
redmass: 1.0625 4.8993 6.0417 6.9036 4.6715 8.8728 4.6614 5.8567 3.6590 1.6888 2.3855 4.7269 7.1343 5.0368 7.1413 6.9465 5.9233 8.4680 3.4589 5.1404 5.0039 1.6808 3.3991 5.1483 3.3108 6.4137 8.5573 5.9242 5.4934 2.9209 3.5455 3.7076 1.5214 5.2794 2.9143 6.9506 6.0995 1.2001 5.4120 6.3726 4.3925 3.2879 4.6462 6.2053 7.5661 1.3733 1.5297 1.4686 5.8368 6.4969 5.0477 1.3732 3.3298 2.6632 1.9876 3.9256 1.3669 1.6718 2.3696 1.5214 2.6722 1.3225 2.8803 1.2796 1.3506 3.4472 2.0499 1.8457 1.4301 1.6321 3.8187 1.2527 3.0653 1.4561 4.6685 3.2258 1.1342 1.0436 1.0481 1.1399 2.2557 2.0188 4.2241 6.2548 5.5157 8.0402 5.2911 6.2697 1.0393 1.0385 1.0981 1.0983 1.0965 1.0902 1.0979 1.0950 1.0924 1.0937 1.0954 1.0792 1.0764 1.0783
irintensity: 0.0457 5.2892 2.9193 8.1900 1.3377 2.0303 7.7901 2.9355 0.6584 0.1472 0.1870 3.5636 1.5414 4.7192 3.4315 2.2359 1.0867 2.8980 17.3626 2.1669 5.0772 34.5032 43.0850 1.6052 3.3904 26.1705 43.0671 47.4516 7.9861 59.4810 38.6438 47.3871 79.9642 124.3896 2.0722 4.7335 105.1617 51.6623 40.4734 40.8812 42.1673 3.6038 1.1109 59.7448 68.9415 24.4525 75.9836 35.4051 20.0622 3.9209 48.5516 1.1072 20.4379 25.9960 16.6829 27.7992 1.2513 8.3609 43.6298 8.7740 8.1216 6.2683 1.5726 107.6355 11.5853 80.7219 29.4245 51.7877 53.1387 125.9077 202.4637 80.4683 82.4123 65.0597 15.0265 240.1747 40.4203 18.4316 20.6166 25.0122 58.2973 377.1688 576.6418 131.3957 27.1818 135.9062 110.8793 221.8402 25.0539 6.9937 14.9820 13.4712 8.9142 14.3330 5.8999 6.5415 26.8171 3.7620 10.8152 42.7395 14.8889 43.4359
temp: 298.150 k
press: 1.00000 atm
elementType: 16 8 8 8 8 7 7 7 7 6 6 6 6 6 6 6 6 6 6 6 6 6 1 1 1 1 1 1 1 1 1 1 1 1 1 1
symmnumber: 1
zpe: 686296.5 jmol-1
zpe.correction: 0.261397 hartree
zpe.thermalcorrener: 0.282896 hartree
zpe.thermalcorrenthalpy: 0.283840 hartree
zpe.thermalcorrgfe: 0.208910 hartree
zpe.sumelectzpe: -1419.993005 hartree
zpe.sumelectthermal: -1419.971505 hartree
zpe.sumelectthermalent: -1419.970561 hartree
zpe.sumelectthermalfe: -1420.045492 hartree
dipole: -0.6003 1.4556 -9.5616
dipole: 9.6904
quadrupole: -64.7652 -159.9893 -139.9549
quadrupole: 11.6021 3.4834 2.2165
quadrupole: 56.8046 -38.4195 -18.3851 11.6021 3.4834 2.2165
hfenergy: -1420.2544017 hartree
pointgroup: C01 [X(C13H14N4O4S1)]
dipole: 0.0726558 0.3480307 -3.7958863 debye
polarizability: 290.2861483|-21.5739984|219.8037063|11.6448991|-35.7832463|155.5703096 unknown
InChI: InChI=1S/C13H14N4O4S/c1-8-7-12(19)16-13(14-8)17-22(20,21)11-5-3-10(4-6-11)15-9(2)18/h3-7,14-15,17H,1-2H3
charge 0 multiplicity 1
36 atoms
S  -0.757745 2.395798 0.173541
O  -1.284983 2.391343 1.696808
O  -0.607164 3.798179 -0.641095
O  -1.859509 -2.503742 1.360188
O  4.445299 -2.29895 1.048505
N  -2.017081 1.563699 -0.954653
N  -3.733317 -0.042081 -1.311203
N  4.553661 -0.473583 -0.427638
N  -1.941203 -0.450669 0.233636
C  0.833281 1.420216 -0.017374
C  1.046275 0.260225 0.744138
C  1.781952 1.967377 -0.898835
C  -2.557619 0.324937 -0.640014
C  3.281125 0.127896 -0.257605
C  2.289756 -0.392914 0.622743
C  3.016334 1.30608 -1.014384
C  -4.309396 -1.305895 -1.070357
C  -3.696486 -2.142264 -0.167751
C  -5.567442 -1.616673 -1.842037
C  -2.456434 -1.749063 0.536871
C  5.080803 -1.616379 0.199217
C  6.500467 -1.956717 -0.251009
H  -2.490205 2.271409 -1.528333
H  0.25634 -0.144174 1.383068
H  1.564538 2.885611 -1.452519
H  2.495809 -1.299227 1.193434
H  3.780915 1.710136 -1.689202
H  -4.180941 0.594507 -1.972424
H  5.174062 -0.006292 -1.093808
H  -4.114153 -3.12792 0.048505
H  -6.365672 -0.880585 -1.627148
H  -5.944327 -2.613514 -1.567679
H  -5.384388 -1.610237 -2.933645
H  6.530744 -2.19557 -1.330376
H  6.844935 -2.834707 0.313198
H  7.196468 -1.118056 -0.063863
