program: Gaussian 09
title: 000146239
version: EM64L-G09RevD.01
frameworkgroup: C1[X(C17H25NO2)]
method: RPBEPBE
basis: SDD
operation: Freq
keyword: #p
keyword: freq=noraman
keyword: PBEPBE/SDD
title: #p freq=noraman PBEPBE/SDD
converged: YES YES NO NO
title: Mulliken charges:
elementType: O O N C C C C C C C C C C C C C C C C C H H H H H H H H H H H H H H H H H H H H H H H H H
charge: -0.217401 -0.274246 -0.085774 -0.356450 -0.361379 -0.444064 -0.450271 -0.401459 -0.182861 0.040844 -0.725278 0.213815 0.178318 -0.397816 0.182374 0.184267 -0.845397 -0.382631 -0.832437 -0.535022 0.230274 0.174845 0.178877 0.215349 0.205040 0.228807 0.224407 0.211860 0.179424 0.252870 0.246378 0.232338 0.211736 0.249970 0.269374 0.233497 0.236728 0.246112 0.243492 0.223513 0.274362 0.230109 0.223820 0.244635 0.225050
chargesum: 0.00000
title: Mulliken charges with hydrogens summed into heavy atoms:
elementType: O O N C C C C C C C C C C C C C C C C C
charge: -0.217401 -0.274246 -0.085774 0.048670 0.032847 -0.010217 -0.014004 0.030836 0.063518 0.040844 -0.031233 0.213815 0.178318 -0.128442 0.182374 0.184267 -0.129061 -0.139139 -0.104453 0.158482
polarizability: 2.84355278e+02 7.70753344e+00 1.95754890e+02 1.05740568e+01 6.09628304e-01 1.34001671e+02
1716.lowfreq: -11.8062 -5.7740 -3.4354 -0.0008 -0.0006 0.0007 11.4515 22.0956 28.6984
frequency: 8.5992 21.7207 28.5694 40.9440 68.7284 77.5553 83.8697 109.7425 132.5626 144.5263 152.0578 165.7367 173.7520 197.6529 204.4375 219.0223 229.8055 244.0984 271.2305 282.6860 315.5741 328.2576 346.2048 352.2032 360.5145 389.3106 478.2957 486.2699 511.2432 545.8042 567.3866 591.1053 610.9201 633.6963 669.0319 719.6653 729.9762 766.6050 780.0668 817.3459 823.7456 848.7066 861.2803 862.9949 899.6532 900.7103 914.5473 953.2152 966.0300 971.5979 978.3349 993.2500 1020.8217 1048.1468 1051.6170 1056.8832 1064.5950 1083.7980 1092.9422 1095.4021 1102.2453 1111.2769 1144.4778 1149.8350 1159.5156 1190.1849 1193.2979 1196.9915 1211.1055 1220.7105 1240.3103 1245.5002 1247.8166 1262.2919 1288.6515 1293.5503 1309.6501 1316.5278 1328.5290 1348.1131 1368.3500 1370.8831 1378.1461 1393.5413 1404.3688 1423.3612 1431.2908 1448.3097 1458.1668 1464.1101 1465.4062 1466.7712 1467.5981 1473.7162 1477.2252 1478.5027 1479.9164 1483.4758 1489.3455 1491.3548 1496.4830 1559.0866 1578.0014 1603.1271 2808.3109 2823.2743 2844.6272 2963.1116 2972.8628 2974.9087 2982.4418 3010.0892 3020.4822 3027.8435 3032.3284 3043.1477 3047.1211 3048.8274 3053.2486 3054.9943 3065.7145 3083.7030 3090.6356 3095.6181 3104.3635 3118.9504 3125.0005 3147.9656 3169.6005
redmass: 1.8015 4.0593 4.2420 2.4094 2.9335 3.9302 3.2405 3.1727 1.7976 1.9156 1.6967 3.5263 1.8395 1.6253 2.3104 1.2254 2.3309 1.5569 3.0512 3.7750 4.2758 3.0256 2.4682 2.2999 3.4162 3.9869 3.5626 4.1818 3.3601 4.2509 3.8528 3.7914 3.3609 3.0328 4.9579 3.8327 2.3435 2.6929 2.1479 1.6535 3.1980 1.7441 2.6099 2.6837 2.4469 2.9606 1.5574 1.4321 1.7353 1.6533 2.0257 2.0424 1.4297 1.8916 1.7173 2.3223 2.4038 2.9920 1.7501 2.0380 2.0982 1.2608 2.3119 1.4852 2.1559 1.3403 1.4820 1.3587 2.6821 1.6176 1.3137 2.7360 2.5262 1.2888 1.2688 1.3228 1.5183 1.2681 1.5909 1.4298 1.2799 6.9162 1.3639 1.2421 1.2291 2.9576 1.4755 1.3132 1.0721 1.0805 1.0665 1.0549 1.1072 1.1394 1.2025 1.2102 1.0900 1.0656 1.1333 1.0658 1.1019 7.5790 6.7926 6.8919 1.0716 1.0714 1.0711 1.0326 1.0425 1.0427 1.0340 1.0600 1.0706 1.0806 1.0846 1.0867 1.0890 1.0919 1.1041 1.0925 1.1045 1.0998 1.1054 1.1004 1.0968 1.0960 1.0998 1.0874 1.0961
irintensity: 0.0886 0.7816 0.5118 0.2845 1.7994 0.4458 3.8304 1.5608 2.8056 2.0933 2.9787 1.3875 1.4918 2.3468 2.2912 0.6107 4.5130 1.7845 6.6036 1.1147 5.7343 5.4640 0.8550 1.0319 0.4569 0.5499 2.5635 17.4228 6.3473 3.2532 4.3319 2.6172 2.1829 0.8221 14.5726 5.9313 0.2508 4.4202 1.8349 41.7419 3.2033 4.5223 3.4482 11.2699 2.1808 25.7983 1.4043 2.5754 9.9011 3.0660 46.1595 8.7484 4.4622 18.3496 31.2853 153.6508 6.8577 14.7590 1.3467 19.4700 50.1697 0.3256 13.3127 6.2487 42.2240 1.4770 33.4076 9.8818 1.4904 18.3391 20.9282 135.6352 153.4927 8.8271 12.8987 2.1243 52.5291 3.6480 56.5260 15.0210 36.5801 2.8169 14.8969 5.9263 20.9408 3.6147 0.9150 10.0306 7.9895 4.7263 13.0617 15.2663 29.2594 61.3654 6.9339 12.4226 6.6548 9.2941 3.6582 34.5021 1.1191 188.0672 64.2824 90.3686 57.1186 90.7839 185.9904 77.8557 34.5929 14.2977 27.8358 19.3183 68.4684 39.0809 9.7377 25.0925 31.8603 35.4934 47.0728 3.6628 3.1746 35.9840 72.3096 15.0425 10.9763 5.5542 23.8787 1.7422 13.3970
temp: 298.150 k
press: 1.00000 atm
elementType: 8 8 7 6 6 6 6 6 6 6 6 6 6 6 6 6 6 6 6 6 1 1 1 1 1 1 1 1 1 1 1 1 1 1 1 1 1 1 1 1 1 1 1 1 1
symmnumber: 1
zpe: 1009440.9 jmol-1
zpe.correction: 0.384476 hartree
zpe.thermalcorrener: 0.406257 hartree
zpe.thermalcorrenthalpy: 0.407202 hartree
zpe.thermalcorrgfe: 0.330822 hartree
zpe.sumelectzpe: -866.440831 hartree
zpe.sumelectthermal: -866.419049 hartree
zpe.sumelectthermalent: -866.418105 hartree
zpe.sumelectthermalfe: -866.494484 hartree
dipole: 1.7327 2.6275 1.1409
dipole: 3.3478
quadrupole: -94.1256 -124.6481 -124.9656
quadrupole: -9.2038 4.7789 -5.4203
quadrupole: 20.4542 -10.0683 -10.3859 -9.2038 4.7789 -5.4203
hfenergy: -866.8253065 hartree
pointgroup: C01 [X(C17H25N1O2)]
dipole: -0.7164553 0.9338681 -0.5910673 debye
polarizability: 285.0565089|-4.212896|193.7736285|8.2719506|-9.9651218|135.2817019 unknown
InChI: InChI=1S/C17H25NO2/c1-12(11-18-9-5-6-10-18)17(19)15-7-8-16(20-4)14(3)13(15)2/h7-8,12H,5-6,9-11H2,1-4H3
charge 0 multiplicity 1
45 atoms
O  0.35312 -2.260848 1.464749
O  -5.163542 0.605553 -0.225065
N  3.761327 -0.063497 -0.077743
C  5.049591 -0.096484 0.661458
C  3.659539 1.314874 -0.62299
C  6.020391 0.645673 -0.28605
C  5.114663 1.680266 -1.036017
C  2.59895 -0.520761 0.702592
C  1.34869 -0.784077 -0.180217
C  0.174437 -1.26887 0.692264
C  1.64136 -1.884836 -1.237091
C  -1.202677 -0.692684 0.511048
C  -1.503841 0.699644 0.35339
C  -2.258988 -1.639852 0.485209
C  -2.844039 1.108662 0.105746
C  -3.871282 0.120379 0.035961
C  -0.446716 1.781594 0.531802
C  -3.585405 -1.25157 0.239746
C  -3.204912 2.574429 -0.059362
C  -6.260757 -0.363549 -0.286156
H  5.351095 -1.138594 0.868527
H  4.979232 0.442124 1.642611
H  3.286854 2.029126 0.158385
H  2.954459 1.35329 -1.472539
H  6.846091 1.126404 0.26697
H  6.461814 -0.065678 -1.004967
H  5.251074 1.595946 -2.127535
H  5.352485 2.720198 -0.751323
H  2.337998 0.217822 1.508728
H  2.857012 -1.468518 1.209538
H  1.060583 0.136738 -0.715502
H  1.833953 -2.848998 -0.733904
H  0.790015 -2.014229 -1.930303
H  2.539925 -1.602583 -1.811833
H  -2.01107 -2.693011 0.651556
H  -0.121101 2.207577 -0.438014
H  -0.849941 2.621245 1.125417
H  0.445465 1.408148 1.056833
H  -4.374698 -2.007469 0.204682
H  -2.524407 3.081373 -0.767327
H  -4.236101 2.680954 -0.426289
H  -3.134122 3.117277 0.904009
H  -6.09958 -1.103886 -1.093337
H  -7.157743 0.234501 -0.504079
H  -6.387201 -0.888404 0.680221
