program: Gaussian 09
title: 000146180
version: EM64L-G09RevD.01
frameworkgroup: C1[X(C12H16Cl2O4)]
method: RPBEPBE
basis: SDD
operation: Freq
keyword: #p
keyword: freq=noraman
keyword: PBEPBE/SDD
title: #p freq=noraman PBEPBE/SDD
converged: YES YES NO NO
title: Mulliken charges:
elementType: Cl Cl O O O O C C C C C C C C C C C C H H H H H H H H H H H H H H H H
charge: -0.080713 -0.064835 -0.291706 -0.287622 -0.427653 -0.429369 -0.113929 -0.064643 -0.281861 -0.297575 0.369244 0.368347 -0.595498 -0.575408 -0.315522 -0.392573 -0.392993 -0.315502 0.251615 0.214566 0.214027 0.240106 0.245069 0.199558 0.289423 0.294684 0.282624 0.276069 0.251824 0.247653 0.246803 0.250612 0.342657 0.342519
chargesum: 0.00000
title: Mulliken charges with hydrogens summed into heavy atoms:
elementType: Cl Cl O O O O C C C C C C C C C C C C
charge: -0.080713 -0.064835 -0.291706 -0.287622 -0.084996 -0.086850 0.137686 0.149923 0.172272 0.147053 0.369244 0.368347 -0.011391 -0.016715 -0.063698 -0.144920 -0.146190 -0.064889
polarizability: 2.24204355e+02 2.79958071e+00 1.25064733e+02 -5.06695675e+00 -1.16292511e+00 1.43917019e+02
1716.lowfreq: -6.9688 -5.9007 -0.0020 0.0007 0.0015 4.2218 15.2736 22.6176 31.5576
frequency: 15.1124 22.5293 31.5294 48.1358 55.8840 58.6319 88.2755 106.6896 140.0045 161.7080 174.2116 184.6267 208.5474 212.6522 222.0557 267.4181 310.4432 311.4145 356.3413 388.2767 410.2445 416.5699 420.0442 456.7248 482.7292 510.9833 525.7536 541.9493 567.9303 631.5143 670.7598 675.2422 707.4699 741.3944 800.1157 814.3551 821.4150 842.5723 845.0221 895.9692 899.4927 925.4974 941.4167 983.7125 987.1290 992.5538 997.2558 1005.0165 1042.2065 1050.5302 1102.5626 1104.9065 1117.7104 1167.6529 1171.1007 1171.8882 1183.6204 1195.7656 1207.7401 1230.9769 1233.2202 1239.5168 1284.5811 1293.8712 1298.8430 1301.4254 1323.5580 1357.1334 1365.8941 1377.7881 1387.0477 1390.6704 1422.8928 1423.5531 1425.9375 1465.8233 1472.9176 1496.8300 1587.6399 1628.6071 2936.3510 2947.9903 2969.2601 3029.5603 3035.7287 3046.7640 3073.8174 3074.3599 3151.4469 3152.6227 3160.5485 3165.1288 3170.3702 3174.0690 3497.3083 3561.6568
redmass: 12.9690 7.2325 9.6837 4.7222 8.1075 5.9999 7.0413 4.7959 4.4113 4.3022 5.8986 3.9356 3.2541 4.0579 3.8385 1.1491 5.0768 4.5486 7.1557 2.6017 2.8833 3.0302 1.1265 4.6756 4.4064 2.3538 4.0911 4.6325 6.9559 6.8883 3.7812 4.1438 3.6564 6.8602 1.2618 5.1515 1.7788 2.3305 2.5586 1.9466 2.2943 1.3708 1.3483 5.2799 5.5504 2.3573 2.4654 2.1623 1.7465 1.5507 1.6167 2.1861 1.2789 1.1982 1.1466 1.1775 1.1075 2.2998 1.6533 1.2377 1.3265 5.8634 1.2627 1.2186 1.2459 1.2908 1.2950 1.6638 1.5107 1.5338 1.8892 1.8746 3.1020 1.2076 1.1070 1.1449 1.1075 2.1482 7.3144 6.7420 1.0820 1.0608 1.0565 1.0884 1.1019 1.1014 1.0569 1.0574 1.0873 1.0878 1.1111 1.1121 1.0964 1.0969 1.0653 1.0663
irintensity: 0.3960 0.9650 1.2320 0.1176 0.9678 0.6165 0.9020 0.3929 2.1136 5.3695 6.1782 8.2788 20.2860 4.1623 15.7500 168.7589 3.4458 2.8696 0.0129 11.3194 5.5896 0.4620 149.3100 19.9852 9.8665 16.1700 18.1594 32.0675 1.0684 0.1245 16.3473 27.0384 0.0227 42.4791 0.2640 18.7178 88.8267 8.7950 7.6569 11.7802 7.2559 0.1263 2.1104 2.7756 66.0515 75.9529 91.2293 75.1427 62.4113 6.6010 62.5186 26.7174 17.8168 29.6483 6.7682 10.3951 72.7878 517.6827 14.7196 9.5266 8.4038 1.3828 19.3391 0.9208 15.7618 0.1862 6.4017 23.3740 4.2792 6.2446 47.3498 0.8594 3.4890 32.5548 26.2352 115.8109 46.3538 248.5229 0.0350 0.2150 33.2616 51.8333 26.0080 8.5331 18.6409 24.1346 16.0286 14.3209 21.9027 2.8008 6.0894 5.1724 12.9526 0.0838 17.2631 11.6571
temp: 298.150 k
press: 1.00000 atm
elementType: 17 17 8 8 8 8 6 6 6 6 6 6 6 6 6 6 6 6 1 1 1 1 1 1 1 1 1 1 1 1 1 1 1 1
symmnumber: 1
zpe: 691122.8 jmol-1
zpe.correction: 0.263235 hartree
zpe.thermalcorrener: 0.282691 hartree
zpe.thermalcorrenthalpy: 0.283635 hartree
zpe.thermalcorrgfe: 0.211366 hartree
zpe.sumelectzpe: -1686.462484 hartree
zpe.sumelectthermal: -1686.443028 hartree
zpe.sumelectthermalent: -1686.442084 hartree
zpe.sumelectthermalfe: -1686.514352 hartree
dipole: 0.0933 -3.3555 0.2867
dipole: 3.3690
quadrupole: -133.5133 -128.2501 -109.2138
quadrupole: 19.1056 7.7455 -4.6258
quadrupole: -9.8542 -4.5911 14.4453 19.1056 7.7455 -4.6258
hfenergy: -1686.7257184 hartree
pointgroup: C01 [X(C12H16Cl2O4)]
dipole: 0.0478373 1.3194817 -0.1165638 debye
polarizability: 223.9689406|-3.4505748|125.1003415|6.4080291|-1.1910447|144.1168253 unknown
InChI: InChI=1S/C12H16Cl2O4/c13-5-9(15)7-17-11-1-2-12(4-3-11)18-8-10(16)6-14/h1-4,9-10,15-16H,5-8H2
charge 0 multiplicity 1
34 atoms
Cl 5.486842 -2.439814 0.144975
Cl -5.276506 -2.466968 -0.142203
O  2.736167 0.3139 -0.560777
O  -2.797525 0.39928 0.541921
O  6.117876 0.546627 0.930799
O  -6.204274 0.491921 -0.922351
C  5.098806 0.340537 -0.099648
C  -5.154744 0.364178 0.093772
C  3.701909 0.337495 0.545813
C  -3.763162 0.383785 -0.562444
C  1.364817 0.335734 -0.232238
C  -1.426418 0.373322 0.212173
C  5.379714 -0.891714 -0.961695
C  -5.442992 -0.899975 0.89491
C  0.859705 0.372039 1.091904
C  -0.533232 0.3905 1.306599
C  0.471533 0.31937 -1.326718
C  -0.921506 0.338251 -1.111956
H  5.175285 1.222865 -0.762401
H  -5.201718 1.206003 0.822816
H  3.571123 -0.55317 1.194396
H  3.586798 1.257026 1.151411
H  -3.632824 -0.513899 -1.197221
H  -3.645905 1.298021 -1.183758
H  6.361088 -0.83388 -1.452862
H  4.565642 -1.088942 -1.672726
H  -6.479643 -0.899724 1.259804
H  -4.718729 -1.008329 1.714199
H  1.530264 0.383612 1.955769
H  -0.941825 0.416499 2.321345
H  0.879876 0.290288 -2.341509
H  -1.591913 0.319162 -1.975889
H  6.276236 -0.326654 1.381003
H  -6.105461 1.358154 -1.393213
