program: Gaussian 09
title: 000010039
version: EM64L-G09RevD.01
frameworkgroup: C*V[C*(SCO)]
method: RPBEPBE
basis: SDD
operation: Freq
keyword: #p
keyword: freq=noraman
keyword: PBEPBE/SDD
title: #p freq=noraman PBEPBE/SDD
converged: NO NO YES YES
title: Mulliken charges:
elementType: S O C
charge: 0.207628 -0.051024 -0.156603
chargesum: 0.00000
title: Mulliken charges with hydrogens summed into heavy atoms:
polarizability: 1.09527878e+01 -7.45079776e-12 1.09527878e+01 -1.82995520e-10 1.31227216e-10 4.80444869e+01
1716.lowfreq: -4.8735 -4.8735 -0.0037 -0.0031 -0.0031 463.9090 463.9090 804.0098 1972.3175
frequency: 463.9085 463.9085 804.0098 1972.3175
redmass: 13.0340 13.0340 19.6940 13.1017
irintensity: 0.7150 0.7150 1.2455 458.6082
temp: 298.150 k
press: 1.00000 atm
elementType: 16 8 6
symmnumber: 1
zpe: 22155.7 jmol-1
zpe.correction: 0.008439 hartree
zpe.thermalcorrener: 0.011381 hartree
zpe.thermalcorrenthalpy: 0.012326 hartree
zpe.thermalcorrgfe: -0.014183 hartree
zpe.sumelectzpe: -511.185410 hartree
zpe.sumelectthermal: -511.182467 hartree
zpe.sumelectthermalent: -511.181523 hartree
zpe.sumelectthermalfe: -511.208031 hartree
dipole: 0.0000 0.0000 -0.6584
dipole: 0.6584
quadrupole: -23.3299 -23.3299 -25.8850
quadrupole: 0.0000 0.0000 0.0000
quadrupole: 0.8517 0.8517 -1.7034 0.0000 0.0000 0.0000
hfenergy: -511.1938485 hartree
pointgroup: C*V [C*(S1C1O1)]
dipole: -0.259026 0.0000057 0. debye
dipolederiv: -0.5949999 0.0000135 0. 0.0000135 0.0179717 0. 0. 0. 0.0179717 -1.4126075 0.000029 0. 0.000029 -0.0898463 0. 0. 0. -0.0898463 2.0076074 -0.0000425 0. -0.0000425 0.0718746 0. 0. 0. 0.0718746 unknown
polarizability: 48.0444868|-0.0008144|10.9527878|0.|0.|10.9527878 unknown
InChI: InChI=1S/COS/c2-1-3
charge 0 multiplicity 1
3 atoms
S  -1.473019 0.00000825 0.0000
O  1.337969 -0.00005346 0.0000
C  0.13505 -0.00002705 0.0000
