program: Gaussian 09
title: 000146369
version: EM64L-G09RevD.01
frameworkgroup: C1[X(C21H24N2O7)]
method: RPBEPBE
basis: SDD
operation: Freq
keyword: #p
keyword: freq=noraman
keyword: PBEPBE/SDD
title: #p freq=noraman PBEPBE/SDD
converged: YES YES NO NO
title: Mulliken charges:
elementType: O O O O O O O N N C C C C C C C C C C C C C C C C C C C C C H H H H H H H H H H H H H H H H H H H H H H H H
charge: -0.281597 -0.275243 -0.277322 -0.283560 -0.273132 -0.210404 -0.220986 -0.438094 0.017845 -0.006287 -0.473474 -0.476280 -0.386841 -0.287459 -0.337226 0.123948 0.104773 0.233140 0.482796 0.211980 0.124330 -0.760427 -0.508015 -0.382552 0.090522 -0.765565 0.388646 -0.210430 -0.397144 -0.498699 0.264199 0.246211 0.210889 0.251464 0.228941 0.321850 0.195832 0.216652 0.235878 0.233965 0.294215 0.259903 0.295427 0.190632 0.319063 0.241199 0.264978 0.193979 0.278454 0.233749 0.284048 0.239408 0.234526 0.237289
chargesum: 0.00000
title: Mulliken charges with hydrogens summed into heavy atoms:
elementType: O O O O O O O N N C C C C C C C C C C C C C C C C C C C C C
charge: -0.281597 -0.275243 -0.277322 -0.283560 -0.273132 -0.210404 -0.220986 -0.143879 0.017845 0.257913 -0.016373 0.004126 -0.064991 0.125026 0.132617 0.123948 0.104773 0.233140 0.482796 0.211980 0.124330 -0.014464 -0.188952 -0.141352 0.090522 -0.028154 0.388646 0.023320 -0.113095 0.212523
polarizability: 3.47940055e+02 7.50880992e+00 2.56958116e+02 1.86796848e+01 8.86677673e+00 2.28491958e+02
1716.lowfreq: -7.8058 -1.6495 -0.0007 -0.0003 0.0008 4.7556 6.1614 16.5226 17.0668
frequency: 5.4779 16.3753 17.0412 32.2880 33.5904 45.5268 47.3802 59.9717 62.3280 67.4396 73.2408 81.8639 89.1803 103.1225 111.0813 133.3032 149.2634 154.8980 160.9648 168.7745 185.3146 196.7691 211.7113 241.0792 248.4154 290.8444 296.2607 314.1669 321.7790 328.8033 350.7578 366.6866 377.5182 400.7758 416.7942 426.0611 428.9192 458.1572 498.1580 519.5598 558.1177 569.2949 573.4774 587.1200 590.3328 623.2651 641.3596 647.1517 656.6618 668.7325 684.1697 700.2620 717.2331 730.2103 739.1431 745.9247 774.6550 782.9116 787.2170 822.4915 848.2374 879.8616 887.7967 904.3935 906.9989 909.7127 932.2278 943.2519 964.9088 969.1414 974.2958 990.3102 998.6700 1000.0876 1025.8809 1033.7991 1035.4504 1041.8043 1044.0532 1058.5644 1082.9571 1097.1615 1107.2594 1111.7831 1113.8598 1125.0994 1136.9483 1142.0751 1149.6081 1172.9766 1174.6170 1184.6737 1205.1149 1213.5485 1220.0308 1242.2678 1244.7442 1274.9185 1278.4338 1296.5623 1302.1753 1310.3159 1318.5531 1322.1115 1327.8834 1333.2223 1342.3473 1362.6597 1379.0826 1392.2000 1405.9476 1410.3718 1423.3394 1427.0592 1430.9759 1438.8558 1445.1542 1450.6014 1459.8159 1462.7501 1463.9633 1466.2676 1471.8410 1472.7674 1474.6425 1492.3708 1564.4437 1584.1144 1587.3544 1610.8153 1628.4780 1645.1121 2979.1083 2985.5906 2987.4922 2988.1629 2999.3119 3001.1093 3016.3753 3033.4241 3049.6484 3050.3656 3068.3368 3076.3127 3082.2453 3093.5644 3100.4680 3109.7729 3116.7390 3120.8752 3137.1783 3146.3398 3156.3759 3181.3905 3187.2314 3545.2786
redmass: 4.8710 5.8677 4.4691 4.9264 3.2281 3.0351 3.5147 2.5958 5.5149 2.2177 2.9186 3.0792 1.7053 3.8252 4.6332 1.4945 4.4727 2.9291 4.0975 3.4021 3.1083 3.4262 4.0880 4.6263 5.4736 6.0746 3.5566 4.1618 3.0571 3.3986 7.0524 5.0903 5.7694 7.0896 5.3660 3.5025 2.7851 4.4670 5.3634 6.7155 3.6897 2.3444 3.8192 3.8434 5.2167 1.7704 3.4972 3.2487 5.9169 5.9093 4.0657 3.0901 8.1612 6.5063 5.4627 5.8395 5.1474 4.9794 4.2724 1.7964 1.7464 4.6678 1.7507 2.6109 4.6705 6.1154 2.1125 1.5228 2.0845 1.4399 1.5979 5.4760 1.7389 3.0047 1.6064 2.1448 1.5549 1.5838 4.8028 4.2159 1.6666 2.1988 3.1435 1.8661 1.2662 2.1896 1.4565 2.0539 2.1491 1.4178 1.2211 2.9864 2.1651 1.3179 7.2251 1.1412 3.6340 1.5138 1.3130 1.7444 2.0949 1.2153 1.7035 1.3213 1.9344 1.9357 1.4387 9.4162 1.5292 4.6978 1.2453 1.1746 1.2091 1.1225 2.9266 1.1523 1.0572 1.0507 1.0949 1.2595 1.0929 1.5135 1.1432 2.1455 1.1513 1.0920 9.2231 6.4283 7.7794 6.9869 4.1092 9.0164 1.0624 1.0398 1.0401 1.0794 1.0689 1.0297 1.0634 1.0589 1.1016 1.0832 1.0981 1.0978 1.1002 1.1054 1.1041 1.0970 1.0959 1.1063 1.0870 1.1044 1.0941 1.0919 1.0959 1.0772
irintensity: 0.8560 2.5176 1.4955 1.4315 0.2143 1.4907 2.2649 4.7252 0.4175 1.0565 1.1596 0.7981 0.3725 5.3288 0.0219 0.4935 4.6509 2.6300 1.1085 0.1250 3.8371 1.2640 3.2631 1.2221 4.0984 1.9217 1.3657 13.9287 5.4512 11.7437 4.5025 1.1850 3.5855 3.2776 4.7660 2.3147 4.7925 10.2091 2.0674 2.1758 1.5032 3.2081 4.9014 7.3584 1.5658 36.4728 3.2015 25.0478 9.1510 2.5525 4.6576 31.3741 32.0160 1.2858 4.4742 7.8365 1.1746 29.3125 6.4871 20.0554 11.5195 6.6023 2.7207 14.0433 29.6184 18.8394 5.3137 1.0262 29.9263 15.1870 19.6287 1.2542 102.4339 276.5783 5.8683 20.6287 15.8473 19.1682 53.7217 71.5667 37.8487 39.9201 127.7334 27.6879 0.2119 0.5332 2.0451 29.4336 57.2704 5.4153 24.1949 43.4339 329.4979 1.2283 325.6954 13.3018 52.1924 5.0657 12.1046 47.6241 24.7386 10.2309 28.5405 4.7463 24.9662 19.2834 7.0963 140.1178 4.9855 18.9318 95.8248 21.8720 28.7089 31.9832 8.5591 106.8235 18.4645 12.9018 12.6721 107.9397 7.1987 192.3478 8.4467 56.9572 56.3840 1.3375 105.7727 10.5489 318.5054 7.5032 3.3140 258.4321 105.8926 18.5031 38.6991 4.1517 44.0635 45.1789 19.9303 41.7834 37.6570 2.1896 15.9023 16.5002 15.2787 52.5437 26.2788 2.8885 3.3985 12.1773 4.6549 13.5345 13.0410 13.4523 4.5493 41.7557
temp: 298.150 k
press: 1.00000 atm
elementType: 8 8 8 8 8 8 8 7 7 6 6 6 6 6 6 6 6 6 6 6 6 6 6 6 6 6 6 6 6 6 1 1 1 1 1 1 1 1 1 1 1 1 1 1 1 1 1 1 1 1 1 1 1 1
symmnumber: 1
zpe: 1109152.1 jmol-1
zpe.correction: 0.422454 hartree
zpe.thermalcorrener: 0.452391 hartree
zpe.thermalcorrenthalpy: 0.453335 hartree
zpe.thermalcorrgfe: 0.355690 hartree
zpe.sumelectzpe: -1448.400183 hartree
zpe.sumelectthermal: -1448.370246 hartree
zpe.sumelectthermalent: -1448.369302 hartree
zpe.sumelectthermalfe: -1448.466947 hartree
dipole: -2.1683 -3.7304 -3.2279
dipole: 5.3886
quadrupole: -167.5837 -174.0835 -162.9438
quadrupole: -13.0638 9.9129 5.5189
quadrupole: 0.6200 -5.8799 5.2598 -13.0638 9.9129 5.5189
hfenergy: -1448.8226372 hartree
pointgroup: C01 [X(C21H24N2O7)]
dipole: 1.1929362 1.3830436 -1.0764024 debye
polarizability: 347.6733494|-10.7272988|258.9367872|-18.4411397|-0.9251045|226.7799934 unknown
InChI: InChI=1S/C21H24N2O7/c1-12-17(20(24)28-3)19(14-6-4-7-15(10-14)23(26)27)18(13(2)22-12)21(25)30-11-16-8-5-9-29-16/h4,6-7,10,16,19,22H,5,8-9,11H2,1-3H3
charge 0 multiplicity 1
54 atoms
O  -3.608151 2.393028 -0.55352
O  -0.933363 2.681465 0.76928
O  -0.50671 0.843103 2.140569
O  3.436812 -1.663655 1.846147
O  5.329336 -0.933188 0.696539
O  -3.236987 -3.563622 -1.185471
O  -3.203844 -1.855019 0.320709
N  2.582627 1.686818 -1.418022
N  -2.623253 -2.62803 -0.539928
C  -3.280308 1.881255 0.807535
C  -4.629972 1.805949 1.551478
C  -5.587847 1.365429 0.416062
C  1.62314 -0.118237 0.492323
C  -5.058594 2.159675 -0.801491
C  -2.254204 2.813838 1.450363
C  0.938774 1.239325 0.248864
C  3.110175 -0.024934 0.164493
C  1.366381 2.031308 -0.803318
C  0.88666 -1.212781 -0.324151
C  3.525084 0.810763 -0.860298
C  -0.191518 1.54584 1.135198
C  0.708623 3.273642 -1.363223
C  -0.47503 -1.481148 -0.036526
C  1.503626 -1.934658 -1.376517
C  4.079156 -0.870367 0.877539
C  4.923122 0.934759 -1.422547
C  -1.180732 -2.416758 -0.816446
C  0.784673 -2.894317 -2.13014
C  -0.574514 -3.145317 -1.864589
C  4.326598 -2.539163 2.637978
H  -2.856731 0.861853 0.708871
H  -4.601572 1.089739 2.389088
H  -4.916614 2.802225 1.941286
H  -5.483721 0.278707 0.246456
H  -6.645853 1.587593 0.63557
H  1.498041 -0.37231 1.558146
H  -5.552759 3.146965 -0.895357
H  -5.16481 1.609601 -1.753561
H  -2.535678 3.867391 1.299669
H  -2.131642 2.575961 2.521641
H  2.88287 2.256265 -2.210749
H  0.765727 4.110892 -0.645939
H  -0.363062 3.10194 -1.546921
H  1.196354 3.586057 -2.305627
H  -0.984092 -0.972618 0.785675
H  2.557875 -1.749721 -1.608278
H  5.56906 1.513434 -0.73743
H  4.910922 1.444609 -2.404318
H  5.402173 -0.050221 -1.52282
H  1.288239 -3.441318 -2.934259
H  -1.160523 -3.867584 -2.438173
H  5.089345 -1.939469 3.163083
H  3.659156 -3.045216 3.349636
H  4.832936 -3.267075 1.981419
