program: Gaussian 09
title: 000146070
version: EM64L-G09RevD.01
frameworkgroup: C1[X(C16H14N2O2)]
method: RPBEPBE
basis: SDD
operation: Freq
keyword: #p
keyword: freq=noraman
keyword: PBEPBE/SDD
title: #p freq=noraman PBEPBE/SDD
converged: YES YES NO NO
title: Mulliken charges:
elementType: O O N N C C C C C C C C C C C C C C C C H H H H H H H H H H H H H H
charge: -0.190059 -0.174139 -0.285250 0.034940 -0.363707 -0.588195 0.165988 0.175095 0.497709 0.056907 -0.389131 -0.407676 0.355886 -0.238836 -0.223789 -0.314670 -0.804978 -0.240487 -0.358728 -0.157376 0.270297 0.272766 0.277095 0.237552 0.237603 0.229724 0.229462 0.244742 0.222412 0.280686 0.236476 0.232115 0.247091 0.232473
chargesum: 0.00000
title: Mulliken charges with hydrogens summed into heavy atoms:
elementType: O O N N C C C C C C C C C C C C C C C C
charge: -0.190059 -0.174139 -0.285250 0.034940 -0.093410 -0.038334 0.165988 0.175095 0.497709 0.056907 -0.151579 -0.170072 0.355886 -0.009113 0.005673 -0.069928 -0.065404 -0.008372 -0.111636 0.075097
polarizability: 2.40624419e+02 1.75874508e+01 1.62243415e+02 -4.12366068e+00 4.58443831e+00 1.44318478e+02
1716.lowfreq: -3.6301 -0.0002 0.0004 0.0008 2.5751 9.3732 19.8600 32.9559 38.5009
frequency: 19.8290 32.9379 38.5001 65.6514 78.9663 101.7902 137.0019 151.1613 177.6991 208.9132 230.7943 252.3297 290.2721 321.4399 326.1193 403.2866 437.4202 445.7382 459.0958 492.3201 516.8575 520.2312 545.1118 578.3070 600.9818 614.2022 615.2997 662.6914 670.5517 703.2938 726.0014 761.9740 773.5590 796.9211 802.1990 813.7265 851.2611 915.4353 928.1274 930.7567 954.5862 976.9882 982.3464 987.5785 989.8954 997.4131 1007.4429 1026.7856 1039.4994 1050.4017 1054.5438 1089.4363 1105.5655 1139.6647 1152.2435 1167.0843 1174.7284 1194.0159 1199.3195 1208.3633 1235.8586 1271.2647 1276.7508 1284.9935 1311.9804 1339.1073 1340.8436 1384.5133 1398.8033 1415.5925 1438.4190 1440.3043 1449.6879 1463.9331 1478.9669 1483.5325 1558.6828 1588.1520 1594.2412 1610.9432 1639.8984 1705.2409 2985.2646 3021.5897 3050.7836 3070.0344 3091.0695 3100.3126 3119.1854 3126.4908 3134.6581 3137.5502 3142.4051 3148.8860 3166.0739 3170.5130
redmass: 4.6834 4.1478 4.4794 7.3619 5.7109 5.7792 3.4297 1.5026 2.5206 4.4082 3.5117 5.8503 4.4011 4.3273 3.9035 2.8149 3.7758 6.1619 3.9832 3.8577 5.6957 3.1969 4.5103 4.5866 4.4619 6.4801 6.3531 6.6431 5.6533 1.9718 2.9678 2.7944 4.6259 2.2028 1.8065 3.5852 1.2497 2.1351 2.6015 1.3547 2.3848 1.3962 1.4329 1.6546 5.7988 1.3267 3.9225 2.5033 2.2354 1.6656 2.3955 1.6210 2.1091 1.3447 5.3489 2.0823 1.0558 1.1154 1.8937 1.9258 1.7276 1.7921 1.7341 1.4838 8.1266 1.3908 4.7079 7.1053 1.2218 2.0697 2.6016 1.7255 1.2624 1.0742 1.1253 2.2493 5.1894 6.5793 6.0099 6.1505 11.8164 12.4298 1.0365 1.0657 1.0846 1.0972 1.1001 1.0981 1.0867 1.0867 1.0875 1.0915 1.0924 1.0961 1.1016 1.1001
irintensity: 0.1344 0.1410 1.3415 1.3170 4.5701 4.0606 2.5430 1.6906 0.6453 2.3516 1.1089 2.8751 4.3812 1.2114 1.7946 0.0143 1.4159 5.4337 1.1493 15.8121 1.0504 5.4886 0.5655 4.4457 5.5684 3.1368 19.5733 1.2063 28.1523 47.7445 34.3737 17.8476 10.2095 26.6491 25.3496 10.6822 0.0726 8.0441 25.5537 0.9471 11.6911 0.5388 0.5924 5.9145 1.4897 0.0863 2.6683 2.2809 10.3483 6.9079 7.4458 9.5553 7.8920 34.3105 210.5176 24.1091 0.1393 0.8564 25.2502 3.9022 0.9985 0.4391 7.2243 4.2821 160.1135 26.2669 154.4129 0.2644 15.5989 60.3402 62.6886 11.4053 15.2104 27.6076 39.6089 19.3120 30.6707 0.5713 1.0395 16.2134 446.4211 38.7852 13.4478 6.1455 7.6329 7.4292 21.0970 6.1603 8.6644 1.1870 2.3606 13.0809 18.8936 33.1582 21.4666 29.9592
temp: 298.150 k
press: 1.00000 atm
elementType: 8 8 7 7 6 6 6 6 6 6 6 6 6 6 6 6 6 6 6 6 1 1 1 1 1 1 1 1 1 1 1 1 1 1
symmnumber: 1
zpe: 691879.3 jmol-1
zpe.correction: 0.263523 hartree
zpe.thermalcorrener: 0.280366 hartree
zpe.thermalcorrenthalpy: 0.281310 hartree
zpe.thermalcorrgfe: 0.216968 hartree
zpe.sumelectzpe: -876.676674 hartree
zpe.sumelectthermal: -876.659831 hartree
zpe.sumelectthermalent: -876.658887 hartree
zpe.sumelectthermalfe: -876.723229 hartree
dipole: -1.4609 -2.1266 -0.3941
dipole: 2.6100
quadrupole: -96.6239 -112.9689 -120.8357
quadrupole: -9.1792 0.5554 11.6062
quadrupole: 13.5189 -2.8261 -10.6929 -9.1792 0.5554 11.6062
hfenergy: -876.9401972 hartree
pointgroup: C01 [X(C16H14N2O2)]
dipole: -0.5715141 -0.8468867 -0.1028226 debye
polarizability: 240.3376308|17.7594044|162.8734597|-6.0539478|3.3646352|143.9752216 unknown
InChI: InChI=1S/C16H14N2O2/c1-11-6-5-9-17-15(11)18-14(19)10-13(16(18)20)12-7-3-2-4-8-12/h2-9,13H,10H2,1H3
charge 0 multiplicity 1
34 atoms
O  0.003063 -0.475031 1.932411
O  1.119486 2.16399 -1.796963
N  0.858645 0.68086 0.045557
N  3.203491 0.886908 0.230757
C  -1.366612 1.257218 0.74201
C  -0.850104 2.313499 -0.266624
C  -0.123216 0.375943 1.024936
C  0.474094 1.767167 -0.807087
C  -2.518743 0.379219 0.24112
C  2.158673 0.053981 -0.011012
C  -2.597717 -0.038214 -1.112726
C  -3.505639 -0.069409 1.153391
C  2.273149 -1.334552 -0.299223
C  -3.648465 -0.877149 -1.54496
C  -4.556787 -0.909433 0.722859
C  3.593682 -1.851822 -0.322732
C  1.071533 -2.214674 -0.560295
C  -4.632442 -1.315858 -0.628948
C  4.456817 0.359536 0.187038
C  4.697705 -1.006777 -0.081197
H  -1.663719 1.712534 1.701957
H  -0.631831 3.275011 0.233357
H  -1.545363 2.523424 -1.09388
H  -1.846248 0.292464 -1.840423
H  -3.446769 0.23547 2.204767
H  -3.699196 -1.188181 -2.594449
H  -5.314299 -1.244205 1.440108
H  3.747155 -2.915209 -0.538036
H  1.376046 -3.172753 -1.014301
H  0.538855 -2.431549 0.383822
H  0.346936 -1.72588 -1.236037
H  -5.448072 -1.965448 -0.9651
H  5.278679 1.057662 0.37878
H  5.721611 -1.392443 -0.101277
