program: Gaussian 09
title: 000146208
version: EM64L-G09RevD.01
frameworkgroup: C1[X(C16H29N3O4)]
method: RPBEPBE
basis: SDD
operation: Freq
keyword: #p
keyword: freq=noraman
keyword: PBEPBE/SDD
title: #p freq=noraman PBEPBE/SDD
converged: YES YES NO NO
title: Mulliken charges:
elementType: O O O O N N N C C C C C C C C C C C C C C C C H H H H H H H H H H H H H H H H H H H H H H H H H H H H H
charge: -0.344188 -0.274187 -0.406580 -0.233925 -0.148599 -0.379602 -0.588357 -0.238791 -0.485170 -0.490159 -0.371407 0.203787 0.236866 -0.207873 -0.016286 -0.157833 -0.417415 -0.042725 -0.713458 -0.737947 0.159957 -0.712859 -0.714274 0.299277 0.272464 0.221238 0.230274 0.263349 0.226115 0.242584 0.224646 0.194100 0.289076 0.373239 0.231332 0.208216 0.221763 0.195172 0.213181 0.252493 0.232305 0.209592 0.237297 0.296276 0.269315 0.228573 0.213356 0.218662 0.215666 0.213756 0.209248 0.378462
chargesum: 0.00000
title: Mulliken charges with hydrogens summed into heavy atoms:
elementType: O O O O N N N C C C C C C C C C C C C C C C C
charge: -0.344188 -0.274187 -0.028118 -0.233925 -0.148599 -0.006364 -0.022766 0.060486 0.008531 0.003464 0.097293 0.203787 0.236866 0.016773 0.177813 0.131242 0.022133 0.179038 -0.052613 -0.058753 0.159957 -0.052268 -0.075604
polarizability: 2.24704079e+02 2.41367891e+00 2.22361247e+02 -2.47093233e+00 -3.05247944e+00 1.67711221e+02
1716.lowfreq: -12.9528 -8.4622 -3.0075 0.0005 0.0006 0.0008 10.5832 30.9518 35.8032
frequency: 4.8726 30.7383 35.7201 46.3108 56.0835 59.1310 65.2276 71.2384 76.2468 91.6673 113.3036 133.7567 145.0488 173.1013 190.1721 196.9920 200.4773 205.0420 228.3779 233.3599 251.3187 255.1214 256.0464 263.3825 287.6171 293.6052 302.5183 326.1316 338.4939 353.0608 372.8515 390.5828 416.3861 425.5998 476.0106 495.2600 529.4374 558.3827 566.6832 600.1105 633.1745 652.9917 668.8798 696.3425 706.9145 725.5089 745.9999 778.4256 793.9582 807.4005 817.7888 846.9222 854.3317 869.1678 892.2803 906.5122 916.8481 922.5581 925.5385 936.3012 937.3259 956.4403 964.4901 974.2906 993.7861 1006.8282 1050.2020 1055.7394 1072.8230 1082.3481 1095.5598 1119.9710 1129.5584 1132.8265 1143.5817 1162.0656 1164.7466 1175.8896 1184.5735 1189.0826 1201.5767 1233.0909 1234.1369 1236.4977 1245.5826 1251.6267 1281.6326 1306.4933 1309.4737 1313.0725 1315.4654 1317.7595 1320.6345 1328.2401 1330.5984 1343.5336 1350.6746 1355.6566 1359.4473 1368.4632 1379.8580 1387.5488 1396.3789 1400.2792 1451.2799 1451.6857 1462.8933 1467.9294 1470.8169 1471.1737 1476.9644 1479.9524 1481.8049 1486.1944 1493.2214 1493.9132 1516.9025 1544.2325 1624.7177 1649.2546 1655.1525 2960.5863 2966.4945 2970.5265 2972.0053 2973.0625 2974.0632 2981.8099 2982.6572 2994.1580 3003.6905 3012.1325 3026.0758 3028.0295 3049.5671 3054.1358 3060.5861 3062.7166 3067.2741 3071.0587 3074.1503 3075.6974 3081.7202 3086.9554 3095.5645 3110.8792 3310.6989 3431.5248 3507.7097 3554.0690
redmass: 4.4698 3.3383 4.6728 3.7818 4.5792 4.5658 3.4155 5.3406 3.6624 4.5378 3.3111 4.5957 3.4878 4.1102 2.0618 1.2491 1.5491 1.8967 1.8451 1.1297 1.7689 1.9378 1.3958 3.3497 2.3781 3.0388 4.4959 3.4429 3.4210 4.1311 2.3247 2.4318 1.9089 4.6932 3.0649 5.5236 3.8484 3.8495 3.0267 2.5611 1.6244 2.6941 5.3581 3.7912 3.8051 1.5953 3.0100 4.0016 1.8673 1.7210 2.6940 4.4207 2.0575 1.9271 1.8957 2.4659 1.1934 2.0407 1.3700 2.0052 2.0350 1.5869 1.5680 2.5267 2.1043 1.9770 1.6460 2.1578 1.5667 1.6228 1.9886 2.0643 3.4094 2.7930 1.9929 2.0037 1.3848 1.7751 1.9699 2.0602 2.0120 1.8323 1.2939 1.5506 1.2449 1.3324 1.6110 1.4553 1.9493 1.4279 1.3901 1.3620 1.3867 1.4245 1.4899 1.3235 1.3705 1.8246 1.4159 1.2192 1.2054 1.3615 2.1061 1.2100 1.0959 1.0803 1.0475 1.0472 1.0582 1.0913 1.0586 1.0555 1.0580 1.1133 1.0506 1.0547 2.1825 3.8821 5.1810 8.9339 1.0876 1.0770 1.0359 1.0826 1.0406 1.0637 1.0367 1.0364 1.0717 1.0691 1.0846 1.0745 1.0733 1.0650 1.1019 1.0971 1.0999 1.0988 1.0997 1.0987 1.0993 1.0993 1.0997 1.0994 1.1033 1.1022 1.0835 1.0456 1.0638 1.0952
irintensity: 0.0672 0.1861 0.9145 1.1518 3.0593 0.0776 1.3113 3.2514 0.4676 1.4030 2.2824 1.0372 1.1622 0.6419 7.8022 16.4652 4.9921 4.4809 1.7623 7.1487 1.3390 1.3679 11.6511 0.7573 2.2176 9.9571 3.0307 5.4352 18.0865 33.9262 0.7650 0.8824 1.8141 7.6932 14.0009 11.6357 19.9462 45.7960 13.1595 2.3477 79.2921 39.3338 7.9641 0.6483 25.2227 239.0210 13.8725 33.1270 71.0723 42.6576 6.1011 16.9313 16.0584 7.6023 2.1808 3.2631 3.1766 7.3198 5.5388 4.1463 21.5665 0.0665 2.2243 1.5824 14.6484 12.8915 48.9662 143.9070 26.2165 6.7236 5.2492 2.4406 7.4581 7.5682 5.3088 19.0202 10.9652 4.2098 14.1749 3.1748 3.8307 16.4269 12.8695 3.6485 1.2120 3.3153 9.6341 8.8766 13.3132 0.5906 7.8299 11.2164 5.6048 3.5345 16.5484 5.6962 1.2345 63.8328 1.5653 23.9553 17.1829 7.3642 48.0337 17.4051 30.1173 8.6545 5.0841 5.5351 9.5755 34.0699 3.7799 7.3588 7.8890 11.3886 11.4348 20.2777 513.8338 26.2247 238.7724 216.5396 35.8929 36.8726 33.2717 8.2127 33.9347 53.7873 26.5772 26.0986 14.4904 25.1783 28.3198 9.5334 31.5538 21.6526 5.7440 22.2296 54.3041 36.9084 9.2613 52.5942 57.6222 30.9536 26.6492 34.5396 26.7167 10.6819 222.5956 2.5921 26.1960 7.7085
temp: 298.150 k
press: 1.00000 atm
elementType: 8 8 8 8 7 7 7 6 6 6 6 6 6 6 6 6 6 6 6 6 6 6 6 1 1 1 1 1 1 1 1 1 1 1 1 1 1 1 1 1 1 1 1 1 1 1 1 1 1 1 1 1
symmnumber: 1
zpe: 1163911.8 jmol-1
zpe.correction: 0.443311 hartree
zpe.thermalcorrener: 0.469630 hartree
zpe.thermalcorrenthalpy: 0.470574 hartree
zpe.thermalcorrgfe: 0.384469 hartree
zpe.sumelectzpe: -1090.464071 hartree
zpe.sumelectthermal: -1090.437751 hartree
zpe.sumelectthermalent: -1090.436807 hartree
zpe.sumelectthermalfe: -1090.522913 hartree
dipole: 4.2335 0.7838 1.8669
dipole: 4.6928
quadrupole: -141.6221 -141.2586 -138.9624
quadrupole: 11.3698 -7.2905 8.5459
quadrupole: -1.0077 -0.6442 1.6520 11.3698 -7.2905 8.5459
hfenergy: -1090.9073814 hartree
pointgroup: C01 [X(C16H29N3O4)]
dipole: -1.6278584 -0.4683344 0.7345461 debye
polarizability: 224.1640403|2.6231874|222.9661285|2.3394769|2.5070707|167.6463777 unknown
InChI: InChI=1S/C16H29N3O4/c1-9(2)8-11(16(22)23)18-14(20)12-6-5-7-19(12)15(21)13(17)10(3)4/h9-13,18,22H,5-8,17H2,1-4H3
charge 0 multiplicity 1
52 atoms
O  -0.841854 0.399048 1.550342
O  1.264829 -2.664785 -1.067705
O  3.719876 -1.196981 1.123667
O  4.913244 -0.0328 -0.486964
N  -1.616246 -1.497037 0.465442
N  1.308942 -0.622693 0.061986
N  -3.405316 1.519637 1.702597
C  -0.367494 -2.276561 0.764946
C  -0.802431 -3.740681 0.558636
C  -1.882873 -3.644426 -0.547738
C  -2.647709 -2.344505 -0.205401
C  -1.78845 -0.217396 0.930232
C  0.809204 -1.880855 -0.176997
C  -3.142002 0.49566 0.677391
C  -3.164054 1.118645 -0.768578
C  2.452977 -0.099937 -0.679029
C  2.317046 1.412664 -1.016552
C  1.988862 2.374092 0.159712
C  -4.606432 1.542322 -1.12271
C  -2.189204 2.311337 -0.897814
C  3.812675 -0.408418 -0.026942
C  3.057868 2.357082 1.279023
C  1.813602 3.806187 -0.402382
H  -0.062739 -2.049648 1.803559
H  0.050296 -4.362489 0.246467
H  -1.229665 -4.143812 1.494812
H  -2.554405 -4.518477 -0.573769
H  -1.387742 -3.551272 -1.529414
H  -3.486326 -2.544806 0.491437
H  -3.05326 -1.84511 -1.102168
H  -3.959103 -0.250771 0.718169
H  -2.839224 0.328636 -1.47892
H  2.493447 -0.658726 -1.637127
H  0.833112 -0.058149 0.787701
H  3.264852 1.72902 -1.492935
H  1.519015 1.506885 -1.778816
H  1.018409 2.074315 0.607987
H  -5.291856 0.673287 -1.153632
H  -4.640708 2.03724 -2.110783
H  -4.978553 2.249077 -0.360017
H  -2.507332 3.136733 -0.235662
H  -2.188121 2.690983 -1.935901
H  -1.153971 2.031373 -0.631878
H  -2.536707 2.004635 1.964945
H  -3.874533 1.146962 2.535035
H  3.122172 1.373403 1.778993
H  2.809926 3.103172 2.056564
H  4.058598 2.602475 0.875963
H  1.533167 4.513976 0.399142
H  1.024606 3.841639 -1.177532
H  2.755639 4.166998 -0.858802
H  4.641747 -1.392849 1.446721
