program: Gaussian 09
title: 000146066
version: EM64L-G09RevD.01
frameworkgroup: C1[X(C12H16N2O9)]
method: RPBEPBE
basis: SDD
operation: Freq
keyword: #p
keyword: freq=noraman
keyword: PBEPBE/SDD
title: #p freq=noraman PBEPBE/SDD
converged: YES YES NO NO
title: Mulliken charges:
elementType: O O O O O O O O O N N C C C C C C C C C C C C H H H H H H H H H H H H H H H H
charge: -0.251187 -0.466074 -0.435849 -0.478171 -0.296436 -0.415169 -0.264208 -0.338726 -0.181533 -0.180600 -0.398850 -0.185431 -0.136981 -0.081303 -0.060449 -0.352948 -0.262066 0.233096 0.222101 0.117400 -0.305249 0.252963 -0.496534 0.236446 0.300195 0.225287 0.293580 0.186207 0.223628 0.356917 0.395623 0.377148 0.370506 0.272992 0.392289 0.386668 0.232788 0.262401 0.249530
chargesum: 0.00000
title: Mulliken charges with hydrogens summed into heavy atoms:
elementType: O O O O O O O O O N N C C C C C C C C C C C C
charge: -0.251187 -0.070451 -0.058701 -0.085882 -0.296436 -0.028501 -0.264208 -0.338726 -0.181533 -0.180600 -0.028344 0.051014 0.088306 0.218892 0.233131 0.056887 0.094851 0.233096 0.222101 0.117400 -0.032257 0.252963 0.248185
polarizability: 2.27477894e+02 5.07011976e+00 1.73382237e+02 -1.53179691e+00 -7.02707663e+00 1.17875065e+02
1716.lowfreq: -9.7544 -3.6764 -0.0007 -0.0006 0.0007 3.6532 33.5821 38.6051 55.9341
frequency: 33.5756 38.6014 55.8975 60.4555 80.0795 86.7933 108.9862 110.7545 125.3576 142.2983 157.2313 173.0437 186.3724 191.1940 212.0390 221.6004 245.1311 257.1628 283.9125 301.4033 323.5450 332.4916 339.7434 369.5729 380.2355 400.2198 421.5543 440.3987 451.8478 509.8232 527.1910 536.1757 563.3537 596.6139 604.7970 621.6469 634.2878 641.9583 681.0121 706.2702 710.1469 728.6958 739.6743 752.0627 785.4909 793.1293 809.3046 837.8647 862.9386 881.2839 922.6846 959.6190 971.8850 984.3873 994.9465 1024.7280 1027.0349 1037.0634 1046.3052 1056.4352 1066.5059 1073.8028 1086.2121 1115.3013 1129.1770 1149.3632 1180.5863 1213.0868 1226.1394 1227.6765 1245.2533 1248.2064 1259.7762 1268.3574 1282.0657 1307.7280 1312.0941 1324.0463 1331.3071 1339.0832 1348.0532 1364.0429 1377.3420 1378.5006 1409.1324 1410.8178 1422.9292 1426.6514 1451.7012 1467.5302 1469.6384 1596.1493 1616.0265 1650.4379 1678.8292 2933.0791 2973.7976 2986.8861 2995.5890 3013.1776 3055.2975 3059.0106 3108.2449 3123.6201 3130.7419 3150.0780 3385.7233 3400.4236 3462.3708 3477.3742 3516.8625
redmass: 8.0160 4.6147 6.8416 5.9879 5.5511 6.8838 5.6078 1.1682 7.6775 6.1034 3.7397 5.5450 6.0881 5.5035 5.6499 5.4666 5.7941 5.0774 4.9127 5.7403 5.9637 9.7773 5.2935 7.0696 7.6147 7.2811 3.9146 4.8304 1.3556 3.1145 5.4877 3.7846 1.2490 2.3822 1.3600 5.3772 2.0455 2.0892 6.2747 3.8059 3.4119 4.4141 5.1748 4.3959 2.6385 3.7307 5.4163 6.1545 3.6479 4.2021 6.3833 2.7401 1.6556 2.3392 3.1796 4.3354 4.5310 5.1937 2.9008 3.5670 4.3859 4.6006 3.4847 1.2629 6.0206 1.4284 1.1563 1.2913 1.2725 4.3062 1.5592 1.2540 1.3873 1.2488 1.3455 1.1838 1.4513 1.2243 1.2283 1.4594 1.6396 1.9173 1.4831 1.6865 1.5100 1.4537 1.1574 2.5188 1.0504 1.0504 1.0786 5.4871 8.6677 6.2203 9.6795 1.0566 1.0868 1.1016 1.0872 1.0285 1.0874 1.0855 1.0888 1.1054 1.0955 1.1065 1.0696 1.0657 1.0651 1.0651 1.0773
irintensity: 0.8026 2.1209 3.7000 2.8403 4.9456 2.3492 0.3704 0.4347 2.6092 7.3833 1.1837 3.7307 0.3544 7.0007 3.6007 25.8635 19.0513 13.5623 0.8941 5.2739 27.8016 4.3663 5.2317 4.9917 19.7698 21.3434 17.7153 4.0861 147.0931 24.0469 8.8751 83.0488 133.2312 82.1121 158.3017 34.3133 47.0951 62.9880 17.7615 7.4788 17.8555 4.5661 23.0317 6.8971 117.9326 20.8943 8.6384 23.0649 2.1288 2.8333 56.0393 40.9626 42.2611 33.6625 73.2537 130.7372 91.1259 61.7135 28.2481 33.0464 173.3100 150.2228 53.1509 0.4259 28.7329 2.0489 16.4361 34.4395 82.3815 4.0072 15.7801 13.3816 71.1156 12.9210 101.6961 42.1780 56.9325 11.0167 50.3059 55.9063 3.8814 43.8845 105.7944 9.2351 115.8616 27.7314 15.4016 77.7070 18.6584 11.7801 5.5275 88.3246 294.2576 403.1880 350.0599 37.4722 10.0008 73.0494 68.7814 23.4543 8.0377 7.6476 9.6686 17.1814 40.3222 10.2259 337.2671 70.5107 109.5444 33.7331 70.4560
temp: 298.150 k
press: 1.00000 atm
elementType: 8 8 8 8 8 8 8 8 8 7 7 6 6 6 6 6 6 6 6 6 6 6 6 1 1 1 1 1 1 1 1 1 1 1 1 1 1 1 1
symmnumber: 1
zpe: 767441.1 jmol-1
zpe.correction: 0.292303 hartree
zpe.thermalcorrener: 0.314445 hartree
zpe.thermalcorrenthalpy: 0.315389 hartree
zpe.thermalcorrgfe: 0.241162 hartree
zpe.sumelectzpe: -1251.630445 hartree
zpe.sumelectthermal: -1251.608303 hartree
zpe.sumelectthermalent: -1251.607359 hartree
zpe.sumelectthermalfe: -1251.681586 hartree
dipole: -1.5294 -1.7682 -3.6188
dipole: 4.3083
quadrupole: -169.6728 -127.9777 -137.2744
quadrupole: -13.7938 0.5845 10.7587
quadrupole: -24.6978 16.9972 7.7006 -13.7938 0.5845 10.7587
hfenergy: -1251.9227481 hartree
pointgroup: C01 [X(C12H16N2O9)]
dipole: -0.5662567 -0.2349823 -1.5802588 debye
polarizability: 227.7326664|-1.0723822|172.669173|5.2425894|7.749986|118.3333566 unknown
InChI: InChI=1S/C12H16N2O9/c1-22-11(20)6(16)4-2-14(12(21)13-9(4)19)10-8(18)7(17)5(3-15)23-10/h2,5-8,10,13,15-18H,3H2,1H3
charge 0 multiplicity 1
39 atoms
O  -2.246525 -0.83602 1.078316
O  -3.821509 1.785963 -0.718763
O  -4.881334 -0.623653 -0.347064
O  -0.522979 -2.827569 -0.075447
O  -1.40342 3.134249 0.061763
O  3.878253 -0.11704 1.731601
O  3.183143 2.209108 0.337065
O  2.18917 -2.177791 -0.793774
O  4.174374 -0.969142 -0.983768
N  -0.719743 0.978786 0.681702
N  0.887715 2.645275 0.263691
C  -2.836078 0.726836 -0.686845
C  -3.546364 -0.637662 -0.920513
C  -2.17442 0.55474 0.722026
C  -2.659345 -1.621624 -0.131761
C  -1.443496 -2.109555 -0.950412
C  0.295169 0.071696 0.948496
C  -0.468795 2.313396 0.322271
C  1.624924 0.401766 0.82392
C  1.996922 1.770487 0.465931
C  2.728238 -0.632708 1.029793
C  3.147123 -1.232807 -0.34058
C  2.536191 -2.85804 -2.075987
H  -2.05246 0.888606 -1.453778
H  -2.689414 1.160645 1.487458
H  -3.591282 -0.883668 -2.00136
H  -3.237047 -2.470546 0.262998
H  -0.941266 -1.25231 -1.450992
H  -1.826477 -2.786583 -1.743645
H  -0.058845 -0.927365 1.227699
H  -3.337993 2.631803 -0.504383
H  -5.205774 0.317776 -0.390013
H  1.10762 3.616841 0.018106
H  2.337462 -1.461678 1.643758
H  0.427106 -2.646338 -0.327691
H  4.169941 0.718432 1.26294
H  1.728144 -3.585142 -2.240653
H  3.510204 -3.362241 -1.975288
H  2.588169 -2.119322 -2.892214
