program: Gaussian 09
title: 000146049
version: EM64L-G09RevD.01
frameworkgroup: C1[X(C14H19NS)]
method: RPBEPBE
basis: SDD
operation: Freq
keyword: #p
keyword: freq=noraman
keyword: PBEPBE/SDD
title: #p freq=noraman PBEPBE/SDD
converged: YES YES NO NO
title: Mulliken charges:
elementType: S N C C C C C C C C C C C C C C H H H H H H H H H H H H H H H H H H H
charge: 0.181088 -0.079031 -0.060633 -0.060825 -0.435538 -0.378146 -0.378362 -0.725015 -0.723211 -0.472948 0.441579 -0.451002 -0.387509 -0.223918 -0.236454 -0.248415 0.203904 0.202254 0.211044 0.210029 0.177352 0.231255 0.209256 0.171217 0.257711 0.253594 0.252524 0.252147 0.189289 0.218298 0.229379 0.297469 0.221734 0.225351 0.224531
chargesum: 0.00000
title: Mulliken charges with hydrogens summed into heavy atoms:
elementType: S N C C C C C C C C C C C C C C
charge: 0.181088 -0.079031 0.143271 0.141429 -0.014465 0.030461 0.002111 -0.213711 -0.218540 -0.065360 0.441579 -0.221622 -0.090040 -0.002183 -0.011103 -0.023884
polarizability: 1.96002053e+02 -1.04398007e+01 1.62053415e+02 -1.30604113e+01 9.79541299e-02 1.27647079e+02
1716.lowfreq: -10.5852 -8.8461 0.0009 0.0019 0.0020 16.9497 41.7514 46.0700 50.2127
frequency: 41.5528 45.9739 50.0927 122.1483 124.4100 140.6460 209.9219 269.8926 280.2964 298.3086 333.8190 338.5856 365.0846 377.7134 408.6409 441.3593 463.9829 522.7363 585.3172 587.1394 605.0976 616.6345 684.6430 707.2413 737.5149 756.0183 790.0563 810.1023 834.7833 855.5926 858.4798 864.2510 899.9394 920.5676 952.0814 955.6224 974.1364 979.6264 985.4672 988.6835 1015.1161 1024.6757 1036.0920 1048.6061 1080.1384 1086.0410 1104.4009 1111.5035 1139.7968 1156.6708 1169.6075 1181.3948 1183.1254 1191.2725 1206.2670 1209.6896 1251.7929 1271.2798 1279.5748 1292.5844 1300.2549 1314.2013 1330.5072 1335.3621 1344.2860 1349.3110 1353.3954 1368.8146 1381.0928 1395.7954 1438.2788 1439.8620 1441.0184 1457.0112 1464.8057 1469.8108 1479.6096 1483.3733 1593.3685 1613.8175 2784.5553 2796.1343 2825.8197 2958.2667 2963.7641 2980.0199 2980.2061 3000.8830 3002.4424 3005.1548 3025.3257 3032.6767 3070.2341 3071.3042 3107.6388 3113.2798 3125.8045 3138.1576 3156.8994
redmass: 4.6084 4.1388 4.1802 5.2105 2.8528 2.6786 4.0516 3.7677 4.3602 2.2677 3.0617 2.0567 3.0734 2.0095 2.8783 2.3567 2.7959 3.5228 5.5811 5.9607 4.9273 6.3699 4.8770 2.3558 1.8308 2.6531 3.4550 3.4533 2.8919 1.5666 1.5436 1.2587 2.2847 1.3977 2.8320 1.8182 2.3989 1.8939 1.3976 5.0091 1.3917 2.2211 1.8692 1.9440 1.5633 1.4068 1.4299 1.6612 1.1430 2.0708 1.0546 1.1370 1.1747 1.0753 1.4301 1.6814 1.4870 1.3922 1.4572 1.7339 1.4603 1.5417 1.5973 1.4331 1.4330 1.5012 1.4544 1.5700 2.9309 1.8091 1.0925 1.2390 1.6784 1.1052 1.0973 1.1152 1.2463 1.7508 6.1386 6.0182 1.0715 1.0711 1.0708 1.0739 1.0813 1.0672 1.0851 1.0631 1.0645 1.0813 1.0871 1.1025 1.1050 1.1054 1.0869 1.0885 1.0907 1.0955 1.1012
irintensity: 1.3885 0.1452 0.1356 1.6826 1.3718 2.7133 1.4510 0.0365 3.0476 0.9967 2.8604 0.2171 0.5717 0.3325 0.3788 1.0070 7.2521 3.7222 2.1558 0.6894 2.7943 0.4366 1.7332 27.2820 46.1683 19.6031 14.0197 3.9445 1.4752 1.0066 0.6012 0.2279 4.7994 6.9752 21.2300 1.5069 5.5366 12.5178 0.2619 0.3663 3.7824 13.6023 1.1406 31.6394 7.4528 0.0842 4.7504 20.0920 1.6958 24.0472 0.0982 2.0790 1.9180 3.2128 0.9162 5.9852 2.8784 36.4791 7.3336 4.3987 4.9231 20.9474 9.2863 1.5275 5.7257 2.2913 0.9160 2.1720 3.9417 2.0883 6.7006 25.6266 5.9330 13.6410 6.2394 10.0591 12.7061 8.2805 0.9687 5.9633 69.0140 118.8175 177.4468 2.6537 34.8588 71.8613 19.5910 51.5955 88.5260 50.4834 20.6406 39.3773 14.2499 21.4000 9.0948 7.5168 5.2766 33.0531 41.8580
temp: 298.150 k
press: 1.00000 atm
elementType: 16 7 6 6 6 6 6 6 6 6 6 6 6 6 6 6 1 1 1 1 1 1 1 1 1 1 1 1 1 1 1 1 1 1 1
symmnumber: 1
zpe: 785446.1 jmol-1
zpe.correction: 0.299161 hartree
zpe.thermalcorrener: 0.313302 hartree
zpe.thermalcorrenthalpy: 0.314246 hartree
zpe.thermalcorrgfe: 0.257452 hartree
zpe.sumelectzpe: -996.478190 hartree
zpe.sumelectthermal: -996.464048 hartree
zpe.sumelectthermalent: -996.463104 hartree
zpe.sumelectthermalfe: -996.519899 hartree
dipole: 1.5236 -2.3445 1.0080
dipole: 2.9722
quadrupole: -96.9833 -103.1890 -102.3682
quadrupole: -3.9403 -1.2536 2.8688
quadrupole: 3.8635 -2.3422 -1.5214 -3.9403 -1.2536 2.8688
hfenergy: -996.7773502 hartree
pointgroup: C01[X(C14H19N1S1)]
dipole: -0.6818397 0.6942171 0.6485006 debye
polarizability: 196.3620523|-12.5980027|156.5319029|11.9214617|10.7461971|132.8085913 unknown
InChI: InChI=1S/C14H19NS/c1-2-4-12(5-3-1)7-15-8-13-6-14(9-15)11-16-10-13/h1-5,13-14H,6-11H2
charge 0 multiplicity 1
35 atoms
S  -1.887041 -1.790421 -1.297828
N  -0.609116 0.884265 0.0318
C  -2.119882 -0.619067 1.370457
C  -3.059205 0.776064 -0.526366
C  -3.334193 0.214663 0.891183
C  -0.850595 0.268009 1.350704
C  -1.767307 1.630345 -0.493377
C  -2.005477 -1.947963 0.590457
C  -3.081707 -0.344913 -1.589712
C  0.660128 1.629507 -0.044264
C  1.892583 0.726767 -0.003577
C  3.093027 1.173011 0.601343
C  1.864392 -0.549857 -0.62092
C  4.253735 0.36493 0.582491
C  3.021663 -1.359738 -0.636043
C  4.221558 -0.905217 -0.037952
H  -2.285961 -0.905982 2.430809
H  -3.885939 1.466485 -0.798724
H  -4.254384 -0.402111 0.891989
H  -3.499919 1.056147 1.592652
H  -0.969567 1.053437 2.148236
H  0.036961 -0.333234 1.621176
H  -1.521906 1.979979 -1.515246
H  -1.988371 2.546274 0.123034
H  -1.089731 -2.496805 0.872584
H  -2.880712 -2.58303 0.819423
H  -4.10267 -0.763608 -1.655559
H  -2.798529 0.04315 -2.584184
H  0.748477 2.406776 0.760983
H  0.656988 2.181594 -1.006723
H  3.120976 2.155627 1.09029
H  0.922319 -0.890883 -1.06878
H  5.176615 0.722463 1.053932
H  2.989241 -2.345328 -1.115301
H  5.118849 -1.534735 -0.051588
