program: Gaussian 09
title: 000146126
version: EM64L-G09RevD.01
frameworkgroup: C1[X(C21H25N5O2)]
method: RPBEPBE
basis: SDD
operation: Freq
keyword: #p
keyword: freq=noraman
keyword: PBEPBE/SDD
title: #p freq=noraman PBEPBE/SDD
converged: YES YES NO NO
title: Mulliken charges:
elementType: O O N N N N N C C C C C C C C C C C C C C C C C C C C C H H H H H H H H H H H H H H H H H H H H H H H H H
charge: -0.201751 -0.247999 -0.068751 -0.065602 -0.242739 -0.414707 0.024231 -0.363290 -0.363086 -0.396958 -0.377713 -0.458062 -0.217100 0.201573 -0.492913 0.403366 0.118981 -0.614557 0.353081 0.074149 -0.357235 -0.414372 -0.327822 -0.250566 -0.247708 -0.384278 -0.155397 -0.240727 0.254067 0.178151 0.185500 0.198954 0.199917 0.205767 0.202989 0.190694 0.207767 0.232136 0.272164 0.256989 0.253590 0.220011 0.188198 0.222586 0.325610 0.272066 0.253478 0.232046 0.231922 0.230849 0.246967 0.233765 0.231767
chargesum: 0.00000
title: Mulliken charges with hydrogens summed into heavy atoms:
elementType: O O N N N N N C C C C C C C C C C C C C C C C C C C C C
charge: -0.201751 -0.247999 -0.068751 -0.065602 -0.242739 -0.089097 0.024231 0.068928 0.021368 0.008726 0.015971 -0.018159 0.055064 0.201573 0.017667 0.403366 0.118981 0.016237 0.353081 0.074149 -0.085169 -0.160894 -0.095777 -0.018644 -0.016858 -0.137311 0.078369 -0.008959
polarizability: 3.11462394e+02 5.10700156e+00 2.45842283e+02 -3.63709711e+00 -3.50378228e+01 2.40988232e+02
1716.lowfreq: -8.4368 -5.5807 -2.9656 -0.0008 -0.0002 0.0007 15.5669 35.1811 37.2015
frequency: 14.1170 35.1509 37.1275 47.7910 51.4722 62.5983 63.7379 82.4399 111.4675 123.1689 137.4974 157.3134 183.2608 192.9682 219.6463 231.7533 245.6677 260.4116 276.9324 292.2019 297.0204 315.9418 330.0459 342.5993 365.0955 373.4078 391.8285 402.5307 404.8101 447.1614 454.8815 485.2654 487.1483 492.7686 515.1538 537.6500 559.7335 568.7214 603.7383 616.5139 621.8155 629.8735 678.0303 683.4865 706.1277 735.0060 751.4035 753.6143 755.7384 771.6754 784.9931 799.6107 806.4474 851.0603 855.9892 859.8636 866.4250 910.1919 918.5574 925.3434 943.2781 960.8878 965.8786 981.5569 985.7375 990.5427 1002.4067 1010.8986 1015.5728 1032.4592 1036.9518 1052.1627 1054.5051 1073.5862 1082.2300 1088.5202 1104.7076 1125.1531 1131.1086 1142.1424 1147.9913 1161.7205 1175.3164 1177.6173 1186.5576 1199.3868 1201.1307 1204.7355 1218.5809 1220.0269 1231.6872 1261.2293 1270.5113 1281.3330 1284.1728 1299.2785 1310.8958 1320.0215 1328.1730 1329.1969 1343.7010 1345.6896 1363.1610 1365.8720 1372.5560 1374.1031 1381.5599 1388.9589 1401.5207 1430.2289 1437.4507 1442.9750 1446.3579 1453.5831 1455.4632 1455.7275 1461.9000 1462.7524 1468.4173 1476.0848 1481.4658 1487.1879 1558.5494 1582.3690 1592.8643 1614.7004 1616.9506 1623.0503 2787.4101 2847.9053 2853.0641 2862.5438 2865.1464 2881.0161 2987.2412 3001.6874 3016.8844 3017.3803 3025.1823 3026.9137 3031.4124 3071.4001 3075.2209 3079.7395 3125.1296 3126.1991 3132.8919 3142.0699 3143.8672 3152.4519 3166.7934 3173.1587 3464.0046
redmass: 5.5950 4.6195 4.9216 4.8359 3.1020 4.3972 6.0570 5.4387 5.7825 4.0027 5.0952 3.9873 4.8348 4.8023 4.1639 1.1808 2.6146 2.0334 3.7433 4.5935 2.9834 3.2833 2.5024 6.3408 2.8805 6.1667 2.5057 3.9162 2.8792 4.9058 4.1895 3.3905 3.4362 3.4976 2.5723 3.8007 4.6593 4.1043 4.8022 5.6825 2.4208 5.2086 5.1496 4.9524 1.9433 3.6895 1.7175 2.4491 2.0846 3.3630 3.3174 3.8747 1.6420 1.7151 3.2252 1.2524 4.1056 1.4437 2.5060 2.0888 2.1014 2.4678 1.3993 2.0477 1.4387 4.7159 1.3533 2.3849 3.0488 2.4210 2.0498 1.6012 2.5239 1.6401 1.6744 1.7754 2.2962 1.6335 2.8091 2.9803 2.7212 2.6835 1.0743 2.0662 1.5809 1.1362 1.1130 1.5314 1.7536 2.4753 1.7401 1.7382 1.7916 2.4678 1.5426 1.4970 1.3614 2.7823 1.6271 1.4499 1.5163 1.3884 1.7773 2.7034 1.5126 1.4204 6.1882 1.4993 1.7805 1.1732 2.1432 1.1098 1.2635 1.0828 2.2493 1.1955 1.0743 2.0067 1.1018 1.1099 1.0539 2.2041 6.5866 6.4773 6.0052 5.2639 3.6179 9.0319 1.0701 1.0666 1.0643 1.0676 1.0690 1.0675 1.0840 1.0655 1.0729 1.0901 1.0878 1.0822 1.0904 1.0955 1.1009 1.0891 1.0898 1.0848 1.0876 1.0901 1.0922 1.0962 1.1015 1.0997 1.0742
irintensity: 0.3886 1.1315 0.4581 0.4770 1.2183 0.6713 1.3501 3.1789 1.0021 4.2305 0.5304 0.4811 0.3496 0.7362 3.2464 0.5028 1.9309 3.8842 3.6595 2.7206 2.7892 13.3485 10.0784 1.3696 4.0845 2.9948 0.2816 1.6933 0.1353 2.8712 4.7178 6.2105 0.7847 3.6640 2.5214 1.3134 5.3642 0.4625 5.5174 1.0267 0.5434 3.4533 9.6650 13.7025 46.4572 20.6861 12.0838 9.7780 35.8432 30.1043 10.3360 13.4954 84.3287 0.7924 6.7525 1.2594 41.2564 0.5969 6.7214 4.5524 46.9013 22.0112 0.8103 2.2321 0.5101 0.1451 1.8116 60.3464 10.4069 5.9741 6.8153 3.6647 3.6102 4.7568 0.2266 6.9170 17.3551 42.5004 9.2795 35.6859 33.5419 260.0062 0.7234 21.2899 33.7301 5.9309 3.4740 4.0071 69.3590 90.2113 85.6312 8.6806 7.5999 39.8840 25.1901 30.2420 6.6352 27.0570 4.0720 5.3956 17.4716 12.6262 36.1482 149.5652 25.1809 13.9491 12.3057 11.1715 59.2574 0.9093 7.6787 7.6380 76.6683 1.6451 97.8341 25.1287 32.0293 51.6417 27.4321 5.7622 8.7990 19.3080 39.5339 51.7051 0.5640 56.5249 305.9394 140.4333 137.5127 67.0666 85.5876 25.2775 68.7250 262.2855 25.3503 6.8257 60.3884 33.4834 64.1840 10.3216 36.6736 13.1701 34.0051 8.9515 8.9077 0.8559 1.2675 11.1725 15.9166 24.0698 19.8587 23.9900 18.9328
temp: 298.150 k
press: 1.00000 atm
elementType: 8 8 7 7 7 7 7 6 6 6 6 6 6 6 6 6 6 6 6 6 6 6 6 6 6 6 6 6 1 1 1 1 1 1 1 1 1 1 1 1 1 1 1 1 1 1 1 1 1 1 1 1 1
symmnumber: 1
zpe: 1136546.6 jmol-1
zpe.correction: 0.432888 hartree
zpe.thermalcorrener: 0.457521 hartree
zpe.thermalcorrenthalpy: 0.458465 hartree
zpe.thermalcorrgfe: 0.377106 hartree
zpe.sumelectzpe: -1237.365405 hartree
zpe.sumelectthermal: -1237.340771 hartree
zpe.sumelectthermalent: -1237.339827 hartree
zpe.sumelectthermalfe: -1237.421186 hartree
dipole: -1.9764 -0.8551 -1.9662
dipole: 2.9161
quadrupole: -149.3115 -158.3532 -172.5811
quadrupole: -13.5492 11.1241 -0.9341
quadrupole: 10.7705 1.7287 -12.4992 -13.5492 11.1241 -0.9341
hfenergy: -1237.7982923 hartree
pointgroup: C01 [X(C21H25N5O2)]
dipole: -0.6889251 -0.5539781 -0.7312465 debye
polarizability: 311.2963538|10.0537675|228.2359906|1.5191571|-30.7864225|258.7605645 unknown
InChI: InChI=1S/C21H25N5O2/c1-24-10-12-25(13-11-24)15-20(28)26-18(16-6-3-2-4-7-16)14-19(27)23-17-8-5-9-22-21(17)26/h2-9,18,23H,10-15H2,1H3
charge 0 multiplicity 1
53 atoms
O  1.36839 1.778137 0.026753
O  -3.401967 -0.123544 3.19279
N  3.341161 -0.148295 0.614643
N  6.206225 -0.234784 0.199037
N  -0.380656 0.22839 -0.024682
N  -2.968235 1.104886 1.311293
N  -0.908371 1.704494 -1.794462
C  3.938277 0.263814 -0.682526
C  4.184089 -1.16894 1.284997
C  5.364506 0.789642 -0.467432
C  5.606522 -0.626156 1.495929
C  1.943124 -0.57066 0.512032
C  -0.959927 -1.045066 0.491235
C  0.981716 0.59038 0.158919
C  -1.451234 -0.849009 1.944216
C  -1.983781 -1.650273 -0.482234
C  -1.274637 1.199098 -0.586672
C  7.609846 0.196546 0.339669
C  -2.484161 1.583929 0.067537
C  -2.659636 0.047011 2.177913
C  -1.70642 -1.633908 -1.874162
C  -3.155886 -2.301679 -0.026428
C  -3.284522 2.565929 -0.583067
C  -2.581428 -2.256373 -2.788194
C  -4.03385 -2.924662 -0.943148
C  -1.676115 2.650889 -2.387159
C  -2.879697 3.117644 -1.809438
C  -3.749515 -2.907376 -2.326204
H  3.315655 1.063425 -1.114277
H  3.973649 -0.598821 -1.395796
H  4.248484 -2.113294 0.686069
H  3.737497 -1.412747 2.26829
H  5.31123 1.731965 0.133953
H  5.814236 1.033325 -1.448184
H  6.235008 -1.412244 1.955692
H  5.557551 0.23961 2.205286
H  1.790022 -1.386807 -0.24803
H  1.650607 -0.995784 1.493321
H  -0.127049 -1.768183 0.546702
H  -0.614197 -0.423331 2.531606
H  -1.695515 -1.816001 2.416847
H  8.208043 -0.619272 0.784608
H  7.732422 1.105802 0.982282
H  8.02981 0.424522 -0.656535
H  -3.805253 1.595456 1.650819
H  -0.813868 -1.112859 -2.238967
H  -3.401483 -2.330762 1.04038
H  -4.220482 2.893218 -0.113289
H  -2.3542 -2.230555 -3.859636
H  -4.937304 -3.422255 -0.573773
H  -1.318804 3.031245 -3.349775
H  -3.483765 3.878741 -2.311744
H  -4.429611 -3.391361 -3.035803
