program: Gaussian 09
title: 000146095
version: EM64L-G09RevD.01
frameworkgroup: C1[X(C19H21ClN2O2)]
method: RPBEPBE
basis: SDD
operation: Freq
keyword: #p
keyword: freq=noraman
keyword: PBEPBE/SDD
title: #p freq=noraman PBEPBE/SDD
converged: YES YES NO NO
title: Mulliken charges:
elementType: Cl O O N N C C C C C C C C C C C C C C C C C C C H H H H H H H H H H H H H H H H H H H H H
charge: -0.069263 -0.317312 -0.267605 -0.083430 -0.482544 -0.402795 -0.450089 0.412752 0.014395 -0.508763 0.515156 0.329765 -0.442321 -0.625711 -0.398324 -0.230075 -0.335944 -0.464178 -0.216765 -0.209519 -0.116170 0.255184 -0.212064 -0.673840 0.223019 0.202311 0.231119 0.228862 0.194344 0.242250 0.222686 0.238455 0.190864 0.300089 0.226971 0.258506 0.234390 0.352980 0.250906 0.252031 0.228626 0.229670 0.213799 0.228734 0.228846
chargesum: 0.00000
title: Mulliken charges with hydrogens summed into heavy atoms:
elementType: Cl O O N N C C C C C C C C C C C C C C C C C C C
charge: -0.069263 -0.317312 -0.267605 -0.083430 -0.129564 -0.179776 -0.016659 0.412752 0.014395 -0.085557 0.515156 0.329765 -0.200071 0.026295 -0.098235 -0.003104 -0.077438 -0.229788 0.034142 0.042512 -0.116170 0.255184 0.246232 -0.002460
polarizability: 3.44063750e+02 1.21724118e+01 2.02264772e+02 1.08566841e+01 6.52887823e+00 1.84143832e+02
1716.lowfreq: -5.6856 -0.0014 -0.0010 0.0009 2.5876 4.1717 17.2613 20.5428 30.5505
frequency: 17.1477 20.4214 30.4580 42.7933 51.8934 66.1633 69.6392 85.0114 107.3566 122.6611 154.5128 169.8451 181.4321 200.9170 227.2098 228.2600 243.4838 251.2674 282.8927 300.1915 311.7742 318.0126 333.1655 362.0049 377.8157 394.5266 400.7598 409.0678 471.7879 481.2494 497.4567 541.1723 585.8502 602.9551 621.3071 622.3431 639.0722 687.8246 699.1373 711.1220 723.8863 728.8880 746.0088 774.5752 801.6605 808.7243 823.3060 825.2657 833.9723 851.4552 872.9422 918.3462 932.2867 946.8868 961.9363 976.3549 989.0320 999.2177 1000.0334 1004.0455 1033.2629 1050.3599 1070.4887 1072.0935 1085.7622 1105.5477 1111.6560 1112.2598 1140.3773 1144.1087 1162.4995 1178.1451 1183.5569 1190.3078 1197.2735 1212.9937 1223.5023 1243.7840 1251.2270 1268.4225 1294.3287 1296.5569 1305.5654 1314.5520 1341.9904 1357.9849 1369.0529 1379.6340 1391.9578 1398.2607 1401.9168 1431.1041 1443.3439 1461.2621 1462.7898 1464.4409 1464.9415 1473.7977 1476.3437 1478.7109 1483.7513 1490.3512 1528.6648 1585.4728 1596.4097 1604.1028 1611.4027 1668.4612 2755.4233 2840.3301 2863.1887 2956.3223 2981.9727 2995.8733 3008.1526 3020.9616 3044.4879 3066.4728 3082.2414 3092.8394 3106.6917 3120.2196 3125.3521 3150.9332 3156.2891 3168.0543 3176.4521 3191.0184 3556.7836
redmass: 4.8676 5.1881 3.5138 3.9135 4.9998 3.5667 3.7325 3.9041 3.9714 3.7239 3.6334 3.8008 6.2053 2.3708 3.3556 2.0367 2.9648 1.2161 3.4962 3.8755 3.6452 5.1198 3.8661 2.9651 4.1418 4.5063 4.6148 2.8753 3.5315 5.2976 3.4553 3.5151 3.7810 6.0421 1.5942 4.5720 3.8392 5.1820 7.5012 5.0989 3.3869 3.0315 3.4019 3.6953 1.0953 1.7377 2.8730 1.3891 1.7900 3.5244 3.9478 1.4732 3.3462 1.4293 1.3874 1.9393 1.3947 3.5464 2.6768 2.3082 2.3184 3.2750 2.8544 2.6082 1.9118 1.3646 1.4459 1.9443 1.4655 2.1310 2.5828 1.3346 1.1231 2.8456 1.5166 1.7916 1.3609 2.2746 1.1298 1.5155 1.6563 1.8444 1.8153 1.7169 1.6874 1.3545 1.6821 5.3537 2.8847 2.3748 1.2863 1.1725 2.7443 1.2025 1.1374 1.0411 1.9157 1.8127 1.0761 1.2813 1.0858 1.0836 2.1270 7.3400 6.2745 6.9588 5.7284 7.7534 1.0707 1.0699 1.0575 1.0836 1.0832 1.0358 1.0581 1.0736 1.0887 1.1069 1.1006 1.0985 1.1026 1.0898 1.0877 1.0953 1.0884 1.0948 1.0967 1.0949 1.0753
irintensity: 0.1098 0.0270 0.8937 0.0223 0.6344 2.1658 0.7717 2.2961 0.6280 2.4095 2.2357 1.7589 1.5384 1.2369 0.8271 1.7543 2.6184 0.6083 7.6448 12.0996 0.5982 3.2032 4.9633 2.6490 11.3608 2.5639 7.2965 0.2581 5.3334 3.8748 6.1267 12.4968 11.5688 3.5188 50.4896 3.4001 4.2614 2.9883 34.6531 8.7942 8.6546 10.0761 32.3882 26.7545 4.2946 29.2684 6.0781 1.6213 47.9603 15.4787 3.5780 10.7958 52.2959 2.5379 0.1643 16.4482 0.7341 33.5464 30.6241 6.5322 47.9626 153.8223 68.0716 109.4299 11.9354 7.0146 2.7232 20.5546 5.5866 93.0664 374.5622 7.2746 0.3383 23.6294 8.1828 34.8556 8.2625 12.3389 0.0159 2.4677 7.2836 38.7283 21.4605 4.9062 24.6462 20.0943 9.1989 0.2995 61.4416 5.2414 22.4020 2.8329 62.9661 4.4034 36.1128 13.8113 131.5481 51.9324 24.7524 43.7595 34.7429 11.6443 459.3928 0.0956 7.2067 137.5895 23.8683 250.4185 109.3765 73.5902 214.1248 25.7384 28.4609 22.7805 27.4862 35.4496 30.6877 8.6527 29.2208 32.5677 45.5606 12.2688 7.3352 21.0603 2.5251 7.7480 1.9199 5.3709 31.3090
temp: 298.150 k
press: 1.00000 atm
elementType: 17 8 8 7 7 6 6 6 6 6 6 6 6 6 6 6 6 6 6 6 6 6 6 6 1 1 1 1 1 1 1 1 1 1 1 1 1 1 1 1 1 1 1 1 1
symmnumber: 1
zpe: 948134.0 jmol-1
zpe.correction: 0.361125 hartree
zpe.thermalcorrener: 0.384017 hartree
zpe.thermalcorrenthalpy: 0.384962 hartree
zpe.thermalcorrgfe: 0.305956 hartree
zpe.sumelectzpe: -1454.895114 hartree
zpe.sumelectthermal: -1454.872222 hartree
zpe.sumelectthermalent: -1454.871277 hartree
zpe.sumelectthermalfe: -1454.950283 hartree
dipole: 2.8878 3.7682 -1.7988
dipole: 5.0769
quadrupole: -148.8919 -146.6896 -144.0562
quadrupole: 9.6300 16.9299 1.6321
quadrupole: -2.3460 -0.1437 2.4897 9.6300 16.9299 1.6321
hfenergy: -1455.256239 hartree
pointgroup: C01 [X(C19H21Cl1N2O2)]
dipole: -1.0847754 -1.5874259 -0.5412195 debye
polarizability: 344.3668568|13.6150914|200.5713716|-5.6475056|-8.4358426|185.5341264 unknown
InChI: InChI=1S/C19H21ClN2O2/c1-3-24-19(23)21-18-6-4-5-15-16(11-22(2)12-17(15)18)13-7-9-14(20)10-8-13/h4-10,16,21H,3,11-12H2,1-2H3
charge 0 multiplicity 1
45 atoms
Cl 6.51721 0.863686 2.370108
O  -5.102812 -0.355442 0.693413
O  -4.533898 1.853307 0.100509
N  0.629779 -2.257523 -0.065593
N  -3.003115 0.035201 -0.029647
C  1.793451 -0.503632 -1.378433
C  1.439114 -2.011102 -1.273377
C  0.541475 0.356979 -1.1758
C  -0.646555 -0.190117 -0.632346
C  -0.703655 -1.64199 -0.16734
C  2.945265 -0.12891 -0.440066
C  -1.810532 0.635871 -0.527638
C  0.575504 1.719688 -1.564841
C  0.566875 -3.673206 0.335933
C  -1.76882 1.997083 -0.9151
C  -0.566735 2.530069 -1.425893
C  2.752374 -0.004648 0.960345
C  4.249627 0.061685 -0.961944
C  3.832424 0.292894 1.82009
C  5.344075 0.363406 -0.118973
C  5.11409 0.471943 1.264468
C  -4.220685 0.644804 0.232611
C  -6.474301 0.117814 1.033296
C  -7.270566 -1.113035 1.45506
H  2.150087 -0.330171 -2.414231
H  0.899877 -2.328064 -2.204048
H  2.365993 -2.607849 -1.205781
H  -1.170014 -1.698606 0.839136
H  -1.369487 -2.226893 -0.866222
H  1.504321 2.136654 -1.970962
H  0.01905 -3.765848 1.291416
H  1.589062 -4.059602 0.490669
H  0.056996 -4.325903 -0.417407
H  -2.663253 2.614021 -0.811604
H  -0.533157 3.583647 -1.723773
H  1.752084 -0.152185 1.376874
H  4.420874 -0.023522 -2.042409
H  -2.999273 -0.970089 0.148628
H  3.680051 0.386433 2.899421
H  6.347142 0.512402 -0.528972
H  -6.395588 0.866453 1.842537
H  -6.904403 0.614969 0.145044
H  -8.301182 -0.816326 1.722007
H  -7.32275 -1.849107 0.634643
H  -6.811419 -1.599338 2.332794
