program: Gaussian 09
title: 000146127
version: EM64L-G09RevD.01
frameworkgroup: C1[X(C10H24N6O4S4)]
method: RPBEPBE
basis: SDD
operation: Freq
keyword: #p
keyword: freq=noraman
keyword: PBEPBE/SDD
title: #p freq=noraman PBEPBE/SDD
converged: YES YES NO NO
title: Mulliken charges:
elementType: S S S S O O O O N N N N N N C C C C C C C C C C H H H H H H H H H H H H H H H H H H H H H H H H
charge: 1.023527 1.020236 0.028431 0.018547 -0.564095 -0.515785 -0.536330 -0.553619 -0.368051 -0.403349 -0.624236 -0.701558 -0.149978 -0.134627 -0.320882 -0.361421 -0.739425 -0.620091 0.324135 0.344061 -0.707178 -0.703158 -0.712232 -0.703686 0.259664 0.230256 0.233104 0.255229 0.284143 0.282435 0.303562 0.275692 0.337078 0.357580 0.347285 0.361534 0.340560 0.275639 0.273835 0.284925 0.303421 0.300139 0.218904 0.217320 0.247109 0.217634 0.212367 0.241350
chargesum: 0.00000
title: Mulliken charges with hydrogens summed into heavy atoms:
elementType: S S S S O O O O N N N N N N C C C C C C C C C C
charge: 1.023527 1.020236 0.028431 0.018547 -0.564095 -0.515785 -0.536330 -0.553619 -0.030974 -0.045769 -0.276952 -0.340023 -0.149978 -0.134627 0.169039 0.126911 -0.172847 -0.040837 0.324135 0.344061 0.182856 0.185327 -0.028899 -0.032336
polarizability: 2.81953439e+02 -2.00503305e+00 2.91235708e+02 1.24707437e+01 6.69467384e+00 2.29957106e+02
1716.lowfreq: -9.0165 -6.0608 -4.2000 0.0011 0.0014 0.0017 11.9236 15.4172 23.5738
frequency: 8.4286 14.6097 23.4923 28.8449 37.5705 45.6718 50.1045 63.9681 67.6521 78.1945 80.7902 97.9844 109.6079 123.5616 138.1610 141.5814 146.4599 155.4612 159.0147 179.2755 185.8128 192.7871 195.5137 197.3077 205.9079 219.5776 221.3979 228.3967 229.6810 245.3193 254.1011 268.7076 276.0870 285.8327 290.6339 312.7697 328.1818 339.0131 346.1183 386.6173 391.1744 409.1678 442.7889 450.2321 469.4943 471.8949 532.3659 565.0424 572.7397 585.4834 592.0881 608.8625 638.0412 647.9595 661.2845 671.1347 709.6434 751.0159 791.3799 797.0216 812.0417 815.4166 875.7260 887.9435 897.2278 903.9085 953.3208 973.3893 984.8209 994.5077 1012.0070 1021.7840 1024.2005 1043.1291 1060.2781 1061.3618 1072.2756 1075.8686 1105.0270 1127.5084 1136.8265 1157.7283 1186.3122 1196.6134 1235.5675 1244.4736 1247.6299 1287.2817 1290.4056 1299.5096 1305.8536 1307.3363 1313.4310 1353.0756 1364.1999 1367.7295 1401.1650 1408.7466 1409.8418 1416.3032 1422.1962 1425.2918 1434.8948 1435.6652 1439.0213 1446.1525 1468.6872 1470.5660 1482.6975 1486.9611 1490.6195 1551.9731 1620.2105 1635.4919 2907.9953 2911.6910 2935.3152 2972.0369 2975.9779 2977.0661 2986.4241 2990.5232 3026.2219 3029.2580 3044.5628 3065.7666 3067.2643 3083.9492 3109.4762 3132.2467 3146.7753 3183.4134 3188.6285 3190.1698 3361.1748 3468.7315 3487.3248 3499.1837
redmass: 5.8941 5.4175 7.3875 7.5209 5.5390 6.1624 5.5808 5.3466 7.0101 4.0159 5.0808 4.2543 2.3185 4.5996 3.0258 3.8577 1.5877 2.1219 3.1984 2.9760 2.5707 2.9150 3.0092 3.1498 5.6298 1.5538 1.3090 3.2147 3.8086 3.7212 4.0037 2.9888 3.4518 3.9842 3.3203 4.3269 2.8373 7.2617 6.6475 2.9383 3.0580 8.5946 4.5912 1.9361 1.7909 2.8457 2.0736 6.9064 5.9241 5.3469 3.9580 3.6964 6.0531 1.5793 2.5826 8.6793 2.8955 3.1385 3.7505 11.9738 2.6643 4.2316 1.9494 3.6181 3.3829 3.7534 2.4907 1.3094 1.7231 1.9844 1.3289 2.1784 1.6918 1.8139 1.9654 2.0237 1.3799 1.3227 2.2780 1.4002 4.4177 1.5791 1.5177 1.3191 1.4322 1.2392 1.5364 1.2857 1.2324 1.3671 1.1481 1.2154 1.7722 1.3767 1.3264 2.5377 1.0591 1.0530 1.2685 1.0530 1.1521 1.0981 1.0619 1.1467 1.0859 1.0972 1.0517 1.0814 1.0833 1.0461 1.0687 1.4869 5.3743 5.9943 1.0399 1.0386 1.0588 1.0649 1.0980 1.0989 1.0999 1.0288 1.0619 1.0248 1.0571 1.0966 1.0936 1.0930 1.1047 1.1092 1.1037 1.1096 1.1085 1.1076 1.0818 1.0763 1.0758 1.0771
irintensity: 0.4943 0.6375 0.1112 0.3063 1.7918 1.2566 0.2130 7.3323 0.8405 2.2303 6.7185 4.2180 4.0036 0.5263 13.5360 2.2605 0.2427 0.7835 8.3639 2.5474 1.4123 1.0880 2.0307 1.5512 4.3253 1.2442 2.7012 9.7838 1.2606 1.8727 0.7813 0.3962 1.3258 5.6499 11.5740 18.4344 48.5824 53.4710 27.0068 17.2598 115.9966 2.6008 101.2068 47.7921 33.2941 46.9431 54.9299 24.7906 25.1288 9.9326 4.0738 6.3735 10.1220 73.5851 6.7279 31.6382 123.3707 58.4277 7.5657 111.9375 62.2598 22.9085 9.5410 37.0112 68.0720 17.4474 2.3022 57.4389 13.8513 7.0838 40.3170 12.2440 52.0531 27.2754 15.7660 20.0850 0.4684 1.4034 10.2548 21.1538 7.5995 0.8186 6.6621 0.3677 15.7723 0.8606 54.1275 56.3517 24.4327 75.5080 9.2132 50.9608 39.4416 31.6364 21.2155 252.1479 4.5541 8.8322 16.3965 5.9982 37.5942 12.8756 13.6823 42.1127 30.9076 8.5800 9.7728 19.6817 3.9851 10.9598 17.3544 218.6136 385.6192 212.2930 73.4729 102.1926 28.0350 38.3693 50.7563 55.9545 13.8167 24.3154 17.4492 8.6461 18.0396 11.1758 35.4127 34.2861 6.0086 8.4144 10.3829 8.8602 0.5026 1.1354 148.2326 16.4566 63.8661 37.3833
temp: 298.150 k
press: 1.00000 atm
elementType: 16 16 16 16 8 8 8 8 7 7 7 7 7 7 6 6 6 6 6 6 6 6 6 6 1 1 1 1 1 1 1 1 1 1 1 1 1 1 1 1 1 1 1 1 1 1 1 1
symmnumber: 1
zpe: 956428.7 jmol-1
zpe.correction: 0.364284 hartree
zpe.thermalcorrener: 0.396657 hartree
zpe.thermalcorrenthalpy: 0.397602 hartree
zpe.thermalcorrgfe: 0.296476 hartree
zpe.sumelectzpe: -2614.806852 hartree
zpe.sumelectthermal: -2614.774479 hartree
zpe.sumelectthermalent: -2614.773535 hartree
zpe.sumelectthermalfe: -2614.874660 hartree
dipole: -4.2678 4.6936 3.4994
dipole: 7.2449
quadrupole: -173.4992 -186.1199 -176.1736
quadrupole: 17.1443 6.2031 1.6697
quadrupole: 5.0983 -7.5223 2.4240 17.1443 6.2031 1.6697
hfenergy: -2615.1711361 hartree
pointgroup: C01 [X(C10H24N6O4S4)]
dipole: 1.1256812 -1.9775041 1.716678 debye
polarizability: 284.4836798|0.003753|290.7177079|-4.405728|-8.9312461|227.9448661 unknown
InChI: InChI=1S/C10H24N6O4S4/c1-11-9(15-23(3,17)18)13-5-7-21-22-8-6-14-10(12-2)16-24(4,19)20/h13-16H,5-8H2,1-4H3
charge 0 multiplicity 1
48 atoms
S  2.794986 1.89753 0.733963
S  -2.311331 2.787001 -1.098789
S  0.048726 -3.997646 -0.018783
S  -0.9569 -2.28155 -1.12208
O  1.884877 2.921373 1.619892
O  2.406752 1.691316 -0.833371
O  -2.64629 4.30732 -0.642956
O  -2.796899 2.221837 -2.558365
N  2.212563 -1.978173 1.22567
N  -3.312083 -0.215119 -1.140157
N  2.689602 0.315111 1.723906
N  -3.075723 1.71376 0.235238
N  4.206797 -0.868556 0.397057
N  -4.036114 -0.311569 1.10609
C  0.852537 -1.895218 1.780519
C  -3.675924 -1.616882 -1.382834
C  0.156316 -3.259656 1.736611
C  -2.772746 -2.62483 -0.647967
C  3.076113 -0.890378 1.068619
C  -3.52005 0.364086 0.105004
C  4.651352 2.242102 0.879045
C  -0.457714 2.406356 -0.910392
C  4.599637 -2.0758 -0.351412
C  -4.163509 0.288519 2.444881
H  0.227181 -1.169829 1.215699
H  0.886509 -1.578066 2.843658
H  -3.630097 -1.785635 -2.473377
H  -4.713138 -1.812145 -1.040959
H  0.716385 -4.025245 2.304241
H  -0.863725 -3.179557 2.142935
H  -2.881171 -2.500153 0.439134
H  -3.008917 -3.657149 -0.951021
H  2.385852 -2.787256 0.620268
H  -3.208968 0.42232 -1.944842
H  1.802012 0.340496 2.246034
H  -3.560131 2.322108 0.907174
H  5.0972 1.288605 0.548752
H  4.826863 2.452994 1.942286
H  4.851932 3.100978 0.223348
H  -0.361592 1.317447 -1.015267
H  -0.156022 2.776662 0.079438
H  0.043578 2.942564 -1.727071
H  3.8321 -2.397732 -1.091512
H  4.803379 -2.939763 0.319303
H  5.524314 -1.862826 -0.910773
H  -4.965538 1.05786 2.495209
H  -3.225042 0.763853 2.807142
H  -4.440839 -0.506164 3.157617
