program: Gaussian 09
title: 000146047
version: EM64L-G09RevD.01
frameworkgroup: C1[X(C13H16O5)]
method: RPBEPBE
basis: SDD
operation: Freq
keyword: #pfreq=noraman
keyword: PBEPBE/SDD
title: #p freq=noraman PBEPBE/SDD
converged: YES YES NO NO
title: Mulliken charges:
elementType: O O O O O C C C C C C C C C C C C C H H H H H H H H H H H H H H H H
charge: -0.288961 -0.291067 -0.283403 -0.279827 -0.263738 0.615139 0.054966 0.278324 0.252050 -0.584378 -0.562411 -0.285342 -0.342621 -0.521060 -0.532688 -0.497652 0.215507 -0.505634 0.248956 0.257923 0.261994 0.251498 0.269292 0.206292 0.231738 0.231756 0.223874 0.244380 0.252748 0.204323 0.229232 0.239524 0.230350 0.238918
chargesum: 0.00000
title: Mulliken charges with hydrogens summed into heavy atoms:
elementType: O O O O O C C C C C C C C C C C C C
charge: -0.288961 -0.291067 -0.283403 -0.279827 -0.263738 0.615139 0.054966 0.278324 0.252050 -0.335422 -0.304488 -0.023348 -0.091123 0.186261 0.167322 0.188651 0.215507 0.203158
polarizability: 3.20439329e+02 -3.10774514e+00 1.79660748e+02 -1.29759074e+00 1.62600750e+00 8.46811003e+01
1716.lowfreq: -6.5373 -3.6672 0.0003 0.0006 0.0008 4.6297 29.8532 46.3293 50.3444
frequency: 29.8184 46.2529 50.3372 54.1159 77.8367 80.0039 84.9199 94.5994 127.9002 145.3329 168.4352 176.0885 183.7527 211.1127 214.4978 224.7217 241.5091 259.5327 282.5483 289.9629 307.9186 327.5153 382.7783 429.9473 451.5039 481.6233 514.9642 564.4735 578.9548 604.2150 654.3977 694.2470 700.3639 727.4393 753.1873 836.9814 864.1111 873.3302 881.1378 892.7994 937.2612 947.1682 987.6761 1010.0348 1027.2977 1074.8752 1106.8634 1108.7876 1112.3045 1112.3564 1121.6165 1141.7708 1147.7721 1153.6152 1157.7990 1162.3529 1208.2773 1233.6447 1264.5489 1308.4557 1339.2397 1381.9656 1406.9545 1420.9649 1422.2081 1441.2530 1444.3528 1450.0449 1452.7633 1454.7755 1463.5057 1466.8363 1468.5164 1470.6717 1481.3411 1483.2157 1569.0941 1597.1687 1613.9228 1646.2615 2966.3383 2970.7595 2977.7900 2999.3678 3057.8286 3085.2996 3089.3404 3096.9861 3098.0303 3126.3308 3126.5575 3130.5806 3143.7571 3157.3880 3161.7438 3171.3979
redmass: 4.5890 3.0732 3.5781 4.7142 1.5592 1.5861 2.1177 2.8842 3.6305 1.6515 4.4572 3.5922 1.4641 2.4905 2.2291 2.2250 6.1670 2.1191 3.7264 2.8066 4.4486 4.3248 4.2800 5.3689 5.5879 5.9302 5.2704 6.1064 4.5241 3.6321 5.2931 6.7455 4.4302 4.2889 3.4673 1.6771 7.2488 1.6465 7.1825 1.9626 6.3686 8.8554 5.7230 1.1874 3.8839 4.8267 1.2576 1.2553 1.2667 1.2583 3.0502 1.7620 1.4528 1.4030 1.4681 2.2013 2.0891 1.4814 1.9406 1.4425 4.1565 4.8871 2.1371 1.2704 1.2017 1.2453 1.4431 1.0503 1.1017 1.1234 1.0577 1.0520 1.4144 1.0631 1.4026 1.2115 7.0677 6.6417 9.0013 5.6570 1.0325 1.0362 1.0348 1.0298 1.1043 1.0950 1.0965 1.0896 1.1041 1.1056 1.1002 1.1051 1.1043 1.0908 1.0919 1.0914
irintensity: 1.6826 5.2574 1.5799 1.0321 1.4936 3.0476 0.1638 1.3885 14.7017 2.0613 0.9451 6.1502 0.7399 3.4430 1.7855 1.9497 1.7680 5.0647 13.4611 1.9221 7.6395 13.2023 9.1636 6.2070 3.8883 12.5952 1.8310 22.6334 1.2440 13.2889 9.6191 0.7806 14.6225 15.2479 8.1917 23.6275 18.4482 38.1111 4.0756 1.0140 18.0020 52.6462 53.0703 51.7075 11.0260 238.7023 15.4356 56.9266 0.1386 0.5780 505.0593 89.7056 4.6770 16.9581 34.6118 14.3123 17.5197 47.9443 438.9448 2.4368 61.3048 79.0462 60.8639 11.0286 25.9312 22.1547 69.8379 13.4276 23.3741 11.8060 27.0410 15.7217 138.2777 32.9562 75.4179 9.8378 169.4456 93.3923 272.3468 195.3952 60.4686 88.6060 89.9572 52.7705 40.5998 35.8546 48.9414 2.9013 30.6603 17.8230 23.2614 13.9485 21.4152 4.4949 7.9699 1.6548
temp: 298.150 k
press: 1.00000 atm
elementType: 8 8 8 8 8 6 6 6 6 6 6 6 6 6 6 6 6 6 1 1 1 1 1 1 1 1 1 1 1 1 1 1 1 1
symmnumber: 1
zpe: 698165.7 jmol-1
zpe.correction: 0.265917 hartree
zpe.thermalcorrener: 0.285878 hartree
zpe.thermalcorrenthalpy: 0.286823 hartree
zpe.thermalcorrgfe: 0.215893 hartree
zpe.sumelectzpe: -879.675656 hartree
zpe.sumelectthermal: -879.655695 hartree
zpe.sumelectthermalent: -879.654751 hartree
zpe.sumelectthermalfe: -879.725680 hartree
dipole: -3.2330 0.8624 1.8524
dipole: 3.8246
quadrupole: -88.1909 -94.6628 -108.7729
quadrupole: -8.7042 -7.8769 -3.0240
quadrupole: 9.0179 2.5460 -11.5640 -8.7042 -7.8769 -3.0240
hfenergy: -879.9415736 hartree
pointgroup: C01 [X(C13H16O5)]
dipole: 1.271796 0.3003319 -0.7459796 debye
polarizability: 320.2862547|-3.2250729|179.6853015|-6.027924|0.9924884|84.8096218 unknown
InChI: InChI=1S/C13H16O5/c1-15-10-7-9(5-6-12(14)17-3)8-11(16-2)13(10)18-4/h5-8H,1-4H3
charge 0 multiplicity 1
34 atoms
O  3.685783 -0.68408 0.087129
O  2.892891 1.981994 -0.091221
O  1.634646 -2.76009 0.02027
O  -5.272546 -0.701673 -0.105605
O  -4.671412 1.55683 -0.204826
C  -0.464017 0.26397 -0.124136
C  2.332998 -0.348333 -0.078083
C  1.87934 1.008701 -0.120526
C  1.356792 -1.392022 -0.064817
C  0.504148 1.308765 -0.153148
C  -0.020455 -1.078867 -0.079046
C  -1.882107 0.63676 -0.147577
C  -2.96427 -0.201442 -0.116622
C  4.647358 -0.19391 -0.926728
C  2.480669 3.386983 -0.016232
C  2.894204 -3.317182 -0.50564
C  -4.33221 0.345458 -0.147885
C  -6.689121 -0.277829 -0.130979
H  0.158969 2.346631 -0.184868
H  -0.72275 -1.916567 -0.067075
H  -2.104993 1.713258 -0.195215
H  -2.876821 -1.290883 -0.0668
H  4.659468 0.906892 -0.948668
H  4.387647 -0.594613 -1.926497
H  5.623526 -0.587479 -0.605009
H  1.870567 3.57434 0.887635
H  1.916031 3.690363 -0.918781
H  3.419417 3.957012 0.04347
H  3.740923 -3.078321 0.155364
H  3.099984 -2.94091 -1.526201
H  2.716118 -4.40353 -0.539704
H  -6.913223 0.367949 0.735289
H  -7.264897 -1.213181 -0.086905
H  -6.907356 0.279706 -1.057962
