program: Gaussian 09
title: 000146042
version: EM64L-G09RevD.01
frameworkgroup: C1[X(C15H15NO)]
method: RPBEPBE
basis: SDD
operation: Freq
keyword: #p
keyword: freq=noraman
keyword: PBEPBE/SDD
title: #p freq=noraman PBEPBE/SDD
converged: YES YES NO NO
title: Mulliken charges:
elementType: O N C C C C C C C C C C C C C C C H H H H H H H H H H H H H H H
charge: -0.431694 -0.100908 0.129850 -0.200663 -0.514202 -0.562942 0.323275 0.295071 0.540170 -0.434662 -0.421785 -0.491109 -0.450660 0.072494 -0.219526 -0.487164 -0.693781 0.251988 0.247214 0.234009 0.232876 0.240894 0.225731 0.235542 0.239578 0.219602 0.212814 0.254801 0.242913 0.220424 0.224473 0.365378
chargesum: 0.00000
title: Mulliken charges with hydrogens summed into heavy atoms:
elementType: O N C C C C C C C C C C C C C C C
charge: -0.066316 -0.100908 0.129850 -0.200663 -0.015000 -0.096057 0.323275 0.295071 0.540170 -0.193768 -0.196054 -0.255567 -0.211082 0.072494 0.000076 -0.019549 -0.005970
polarizability: 2.79217163e+02 9.29209833e+00 1.92439869e+02 -4.30478716e+00 3.85466701e+00 8.48745716e+01
1716.lowfreq: -0.0008 -0.0006 -0.0005 3.0255 5.7645 9.2492 31.4757 62.0854 80.8144
frequency: 31.3419 62.0324 80.7804 126.3299 143.7716 173.0551 204.1397 216.9347 219.0145 239.9096 294.5676 313.5241 354.5760 382.1619 432.4609 442.9613 449.8701 503.5433 512.5715 527.4888 555.1974 566.7585 624.9877 637.2441 647.5047 690.4093 713.2908 754.1034 772.4156 795.1862 818.2766 828.5678 833.2927 854.7016 895.5358 904.0384 955.9114 962.1876 977.6170 979.0913 1004.0182 1008.3318 1032.7517 1050.8779 1064.4140 1100.2929 1125.5892 1139.5885 1176.1433 1192.2739 1196.8629 1218.4585 1227.6776 1243.8651 1249.5419 1254.7622 1285.6771 1316.0562 1347.3961 1355.8832 1386.3545 1394.9305 1417.5624 1432.7561 1456.9588 1467.9954 1470.3825 1473.6586 1481.7382 1490.0465 1501.6030 1536.1440 1593.0625 1609.1126 1627.3380 2986.8001 2992.3154 3010.7865 3019.7046 3035.4086 3057.8786 3069.3700 3083.6968 3099.7019 3119.8966 3127.8538 3134.0372 3152.8128 3159.9124 3571.3670
redmass: 3.7774 4.3853 3.1301 1.9705 4.0137 4.2065 1.2191 2.6401 2.8635 4.6891 5.1320 4.9318 4.7257 2.8056 1.1997 3.9970 3.3210 4.2871 4.7359 5.1833 2.5443 5.6343 4.1555 5.1900 4.3136 3.9082 3.2644 1.7637 1.2535 1.4992 4.3136 1.6939 3.1628 2.3032 7.1966 1.4365 3.2042 1.3590 2.6297 1.3906 2.0324 4.2781 2.4897 1.8302 1.8091 2.4925 2.3509 1.1924 1.1953 1.1144 1.3947 1.3416 1.6776 1.3677 1.5563 1.9804 1.8227 1.3983 2.2714 3.0668 1.2067 4.2931 1.9636 1.3103 1.2342 2.3206 4.1500 1.0591 1.1961 1.1516 2.7317 6.3197 8.4650 6.7040 7.8055 1.0350 1.0602 1.0628 1.0603 1.1016 1.1003 1.1008 1.0998 1.1017 1.0856 1.0880 1.0921 1.0986 1.0940 1.0673
irintensity: 0.2829 0.1094 0.2162 0.0437 0.6499 0.0620 0.3893 0.9592 9.6645 2.4043 2.2170 6.9719 0.0655 2.9413 128.7072 1.9573 0.7568 5.6483 2.5692 27.4029 0.4681 2.7068 0.7763 2.5047 1.5083 8.8408 7.2379 11.9827 25.6096 1.8305 3.6162 36.3952 109.1777 38.8169 90.6657 2.2098 2.0017 0.5343 7.6517 2.2919 1.4639 1.0216 6.7543 6.1438 21.8944 2.5426 0.2332 0.2770 0.9566 0.1443 5.2267 12.1939 73.5219 25.8434 15.5158 10.9381 0.9540 1.7044 13.9491 9.3194 15.9143 2.2267 3.4421 2.3290 10.8456 2.1898 6.3356 9.6123 9.8882 29.1101 2.8117 1.9889 29.5851 0.4709 16.4545 36.6803 27.2801 16.0048 20.7513 3.5799 20.6660 2.7612 49.8045 27.0523 0.5895 4.9915 22.1927 47.5551 23.5467 69.5497
temp: 298.150 k
press: 1.00000 atm
elementType: 8 7 6 6 6 6 6 6 6 6 6 6 6 6 6 6 6 1 1 1 1 1 1 1 1 1 1 1 1 1 1 1
symmnumber: 1
zpe: 682044.9 jmol-1
zpe.correction: 0.259777 hartree
zpe.thermalcorrener: 0.274400 hartree
zpe.thermalcorrenthalpy: 0.275344 hartree
zpe.thermalcorrgfe: 0.218154 hartree
zpe.sumelectzpe: -709.336380 hartree
zpe.sumelectthermal: -709.321757 hartree
zpe.sumelectthermalent: -709.320813 hartree
zpe.sumelectthermalfe: -709.378003 hartree
dipole: -0.0261 0.5902 0.0270
dipole: 0.5914
quadrupole: -91.7965 -85.1061 -104.0824
quadrupole: 0.4222 -0.3183 1.1818
quadrupole: 1.8651 8.5555 -10.4207 0.4222 -0.3183 1.1818
hfenergy: -709.5961569 hartree
pointgroup: C01 [X(C15H15N1O1)]
dipole: 0.0073563 -0.2321345 0.0137104 debye
polarizability: 279.1601234|8.4741249|192.1258112|8.1728304|-5.0866353|85.2456686 unknown
InChI: InChI=1S/C15H15NO/c1-2-14(16-17)12-8-6-10-4-3-5-11-7-9-13(12)15(10)11/h3-6,8,17H,2,7,9H2,1H3
charge 0 multiplicity 1
32 atoms
O  -4.164082 -1.599695 -0.210692
N  -2.715795 -1.342263 -0.109222
C  0.041424 -0.583421 -0.099518
C  1.379562 -0.098543 -0.035855
C  0.070978 -2.10387 0.006726
C  1.595718 -2.486177 0.08641
C  2.335892 -1.15214 0.080764
C  -1.019879 0.339347 -0.238201
C  1.740093 1.283804 -0.08679
C  3.692239 -0.828266 0.155565
C  -0.664022 1.74425 -0.286601
C  0.651785 2.210051 -0.212193
C  3.138015 1.591686 -0.007457
C  -2.449486 -0.058223 -0.330817
C  4.078317 0.555973 0.111533
C  -3.536093 0.962068 -0.63599
C  -4.123668 1.591584 0.657173
H  -0.489988 -2.439268 0.897844
H  -0.4432 -2.575367 -0.850507
H  1.896829 -3.112139 -0.775101
H  1.81833 -3.073655 0.996692
H  4.462205 -1.602792 0.245618
H  -1.465076 2.484216 -0.376403
H  0.851791 3.287247 -0.249997
H  3.470528 2.635817 -0.040535
H  5.144124 0.806319 0.171854
H  -3.138792 1.7501 -1.298919
H  -4.349041 0.450127 -1.178849
H  -4.57599 0.809347 1.290342
H  -4.908781 2.327065 0.404639
H  -3.345704 2.106953 1.248651
H  -4.204131 -2.577832 -0.056064
