program: Gaussian 09
title: 000146034
version: EM64L-G09RevD.01
frameworkgroup: C1[X(C11H12Cl2N2O5)]
method: RPBEPBE
basis: SDD
operation: Freq
keyword: #p
keyword: freq=noraman
keyword: PBEPBE/SDD
title: #p freq=noraman PBEPBE/SDD
converged: YES YES NO NO
title: Mulliken charges:
elementType: Cl Cl O O O O O N N C C C C C C C C C C C H H H H H H H H H H H H
charge: 0.060165 0.047680 -0.424244 -0.491068 -0.243604 -0.207064 -0.201664 -0.379531 0.027938 -0.109582 -0.290803 0.502365 -0.377460 -0.369005 -0.365907 0.427257 -0.368819 -0.390556 0.374079 -0.731165 0.270841 0.258970 0.243766 0.224280 0.338069 0.251458 0.302304 0.348257 0.288363 0.294590 0.369598 0.320493
chargesum: 0.00000
title: Mulliken charges with hydrogens summed into heavy atoms:
elementType: Cl Cl O O O O O N N C C C C C C C C C C C
charge: 0.060165 0.047680 -0.075987 -0.121470 -0.243604 -0.207064 -0.201664 -0.041462 0.027938 0.161259 -0.031832 0.502365 0.090587 -0.117548 -0.063604 0.427257 -0.080456 -0.095966 0.374079 -0.410672
polarizability: 2.08189206e+02 -3.32089356e+01 1.81535359e+02 -1.67204914e+01 -1.88792067e+01 1.29449212e+02
1716.lowfreq: -8.1418 -4.7178 -0.0024 -0.0018 0.0004 1.7398 5.6383 18.1369 31.0517
frequency: -2.2859 17.9332 31.0059 48.6984 54.9430 68.1707 93.8094 101.8991 110.2409 127.7160 155.2065 192.4246 198.2519 213.1626 228.9853 243.9898 265.2218 281.1994 289.3812 303.9340 321.2880 347.5730 408.6450 417.4507 467.1939 479.0463 514.5724 541.0381 575.1273 620.5301 627.7326 654.2069 662.8339 673.8806 700.6293 722.0437 742.1015 756.7136 775.4135 816.6884 853.7665 875.6111 894.0489 919.6052 938.5217 969.4912 989.4031 998.2545 1010.3568 1020.9185 1067.8489 1092.6838 1102.9193 1123.1432 1152.5075 1179.4541 1187.3510 1188.8008 1200.7399 1211.9454 1224.1259 1235.6170 1270.4438 1289.3178 1306.5402 1313.0942 1355.2249 1362.8488 1380.7872 1391.2922 1402.0238 1426.4625 1474.1203 1477.4789 1483.8073 1596.2085 1609.1509 1626.2348 2986.8147 3039.9804 3057.0514 3061.8059 3109.7886 3137.1255 3142.1987 3183.4625 3185.6155 3510.1562 3543.5721 3614.0034
redmass: 20.4038 10.8993 7.7329 7.3618 11.6883 6.5433 7.0528 5.9987 5.7701 7.7754 7.9281 9.7513 8.5139 7.5945 1.7133 2.1272 5.3719 6.3000 6.7043 1.1178 6.7247 5.4581 2.9318 4.7826 4.9133 4.7703 5.2221 3.8294 4.4189 11.3018 6.9277 1.5909 4.8702 4.4734 3.8513 6.1016 4.8252 8.3412 6.0104 4.1327 1.3190 1.5929 3.8777 4.6669 3.9985 2.6503 1.3517 1.7044 2.1132 4.4095 2.7416 3.1692 1.6772 1.4877 1.2484 1.3205 1.0771 1.4791 1.4720 1.5868 4.2630 1.4395 1.4436 1.4507 1.3957 1.6250 1.1624 3.4712 2.3445 1.4290 5.5162 2.5259 1.1716 1.5926 2.4002 7.4611 6.1415 8.3815 1.0580 1.0843 1.0869 1.1061 1.0894 1.0923 1.0908 1.0942 1.0950 1.0776 1.0665 1.0671
irintensity: 0.2410 0.1627 0.1814 1.1002 1.0591 1.8647 3.5214 3.4667 5.3811 1.2390 3.7888 2.8386 1.0387 1.0052 134.1664 43.0109 11.5969 10.3058 8.9361 130.3975 6.1967 3.8390 0.3903 6.7585 4.0936 20.1480 6.4161 13.6561 23.2735 148.6604 7.0045 58.8139 29.0532 38.1260 60.8497 16.1750 1.6609 47.6874 18.1216 18.3077 9.7350 72.6730 19.5848 11.9698 64.4867 12.3794 3.9630 0.4928 3.3414 48.7742 33.6199 16.2068 14.7219 4.1626 16.1068 36.5768 5.8008 76.0776 93.3447 132.6610 151.2331 1.1803 10.9903 8.5145 12.9017 22.5991 11.1068 74.5640 51.6738 2.2570 2.8431 42.5168 31.4858 193.3411 2.9551 2.9039 20.2943 133.5416 48.2115 5.8933 10.7747 16.6602 6.8900 5.6861 5.9545 0.7521 3.0834 62.3452 13.3626 14.5674
temp: 298.150 k
press: 1.00000 atm
elementType: 17 17 8 8 8 8 8 7 7 6 6 6 6 6 6 6 6 6 6 6 1 1 1 1 1 1 1 1 1 1 1 1
symmnumber: 1
zpe: 595887.5 jmol-1
zpe.correction: 0.226962 hartree
zpe.thermalcorrener: 0.246476 hartree
zpe.thermalcorrenthalpy: 0.247420 hartree
zpe.thermalcorrgfe: 0.176426 hartree
zpe.sumelectzpe: -1830.520389 hartree
zpe.sumelectthermal: -1830.500875 hartree
zpe.sumelectthermalent: -1830.499931 hartree
zpe.sumelectthermalfe: -1830.570925 hartree
dipole: -4.9839 6.9291 -2.1097
dipole: 8.7922
quadrupole: -150.9712 -132.6175 -125.9908
quadrupole: -3.2497 6.8173 2.6163
quadrupole: -14.4447 3.9090 10.5357 -3.2497 6.8173 2.6163
hfenergy: -1830.747351 hartree
pointgroup: C01 [X(C11H12Cl2N2O5)]
dipole: 2.4085228 2.27488 0.9946962 debye
polarizability: 218.5186469|27.8312519|167.4332495|-11.677561|24.2728899|133.2218804 unknown
InChI: InChI=1S/C11H12Cl2N2O5/c12-10(13)11(18)14-8(5-16)9(17)6-1-3-7(4-2-6)15(19)20/h1-4,8-10,14,16-17H,5H2
charge 0 multiplicity 1
32 atoms
Cl 1.135743 -3.677716 0.283972
Cl 4.101492 -3.205961 -0.340642
O  0.60393 3.287842 -0.555801
O  3.478244 2.042938 1.351864
O  1.830439 -1.267968 -1.717175
O  -5.243873 -0.446542 0.885248
O  -4.606287 -1.561227 -0.999894
N  2.23281 -0.04262 0.228516
N  -4.385148 -0.73116 -0.03672
C  2.020042 1.2785 -0.385846
C  0.749828 1.995197 0.166723
C  -0.554237 1.210845 0.115427
C  3.259923 2.145983 -0.108369
C  -1.548155 1.494638 1.090045
C  -0.843477 0.275579 -0.914287
C  2.165108 -1.212265 -0.500202
C  -2.805375 0.865238 1.05195
C  -2.097793 -0.364821 -0.968856
C  -3.061315 -0.058811 0.014862
C  2.531506 -2.453937 0.328841
H  1.919541 1.121542 -1.475362
H  0.960148 2.310024 1.203706
H  3.051414 3.188207 -0.413128
H  4.134318 1.746884 -0.658691
H  2.61077 -0.021207 1.181325
H  -1.330547 2.222094 1.880021
H  -0.087727 0.011914 -1.662195
H  0.101269 3.127257 -1.396185
H  -3.580334 1.070366 1.794824
H  -2.332435 -1.096783 -1.745758
H  4.18646 2.66772 1.638815
H  2.724217 -2.24595 1.389671
