program: Gaussian 09
title: 000146032
version: EM64L-G09RevD.01
frameworkgroup: C1[X(C5H7ClO)]
method: RPBEPBE
basis: SDD
operation: Freq
keyword: #p
keyword: freq=noraman
keyword: PBEPBE/SDD
title: #p freq=noraman PBEPBE/SDD
converged: YES YES NO NO
title: Mulliken charges:
elementType: Cl O C C C C C H H H H H H H
charge: -0.042037 -0.184202 0.452642 -0.762990 -0.784046 -0.216522 -0.091635 0.253861 0.227521 0.259798 0.246229 0.243288 0.231333 0.166758
chargesum: 0.00000
title: Mulliken charges with hydrogens summed into heavy atoms:
elementType: Cl O C C C C C
charge: -0.042037 -0.184202 0.452642 -0.021809 -0.063196 -0.216522 0.075124
polarizability: 1.00016162e+02 1.46407758e-01 7.16163002e+01 -2.76077905e-01 -5.81040027e-01 3.68277125e+01
1716.lowfreq: -11.2559 -3.7386 -0.0032 -0.0030 -0.0018 12.6435 24.5679 99.5470 148.2178
frequency: 20.1172 99.5340 148.2154 167.8664 221.4998 248.0966 329.8838 366.0414 418.4909 516.1913 535.1191 616.2487 871.0470 936.9196 956.7301 973.8215 1062.2687 1075.6049 1131.1187 1247.8892 1371.7495 1389.8603 1404.7008 1450.6248 1456.6620 1468.3553 1471.2474 1600.0763 1621.1541 2916.1562 2976.4250 2979.8870 3049.0851 3063.6473 3105.5147 3121.0095
redmass: 1.0785 3.2603 1.7613 1.4329 8.8529 4.1477 2.7277 2.8958 4.2657 3.2169 4.0724 6.5154 3.3729 1.5686 1.3942 1.3513 2.2310 1.6879 3.4999 4.7177 1.2452 1.1979 1.1581 1.0808 1.0660 1.0889 1.0671 9.0928 5.4673 1.0831 1.0398 1.0402 1.0966 1.0919 1.1005 1.0960
irintensity: 0.5588 0.4118 1.2445 5.7719 3.8093 0.2873 12.3080 3.9796 1.5793 0.2958 3.8772 44.1006 8.3622 0.8481 1.4302 2.5515 56.4323 14.2233 15.7437 22.1376 22.7580 38.0906 3.5503 21.0610 11.7499 28.5937 19.0436 222.7749 65.5771 75.4024 5.0399 22.8182 11.2671 18.4832 10.3457 21.2301
temp: 298.150 k
press: 1.00000 atm
elementType: 17 8 6 6 6 6 6 1 1 1 1 1 1 1
symmnumber: 1
zpe: 277467.0 jmol-1
zpe.correction: 0.105682 hartree
zpe.thermalcorrener: 0.114344 hartree
zpe.thermalcorrenthalpy: 0.115288 hartree
zpe.thermalcorrgfe: 0.070907 hartree
zpe.sumelectzpe: -729.441564 hartree
zpe.sumelectthermal: -729.432901 hartree
zpe.sumelectthermalent: -729.431957 hartree
zpe.sumelectthermalfe: -729.476339 hartree
dipole: -5.7446 0.6789 0.0513
dipole: 5.7848
quadrupole: -53.4451 -46.8416 -48.8787
quadrupole: -3.3298 -0.1317 -0.0882
quadrupole: -3.7233 2.8802 0.8431 -3.3298 -0.1317 -0.0882
hfenergy: -729.5472455 hartree
pointgroup: C01[X(C5H7Cl1O1)]
dipole: 2.1212919 0.8103734 0.1523604 debye
dipolederiv: -0.1549515 -0.1075662 -0.0113001 -0.1888807 -0.6680102 -0.04431 -0.022046 -0.0349439 -0.0617081 -1.1338316 0.111686 -0.0430473 -0.0859202 -0.3348903 -0.0067364 -0.0541668 0.003902 -0.3281529 0.662057 -0.151435 0.0162645 0.0110424 0.1156221 0.0216113 -0.0143335 0.0121221 -0.0156901 -0.100294 0.1611782 0.0272349 0.1889184 -0.1817393 -0.0134851 0.1780041 -0.0190669 0.0363667 -0.110896 -0.1334888 -0.0171042 -0.0378186 -0.1167216 -0.0147769 -0.0273763 -0.033027 0.0532395 -0.7782082 0.4429875 -0.0118547 0.5996478 0.7074759 0.0849594 -0.0057397 0.0711625 -0.1090659 1.4780855 -0.2512058 0.0644428 -0.3414072 0.4837784 0.0053528 0.0651541 0.0113394 0.1699473 0.0354611 0.0200266 0.0213426 0.0466348 0.1071962 -0.0257041 0.0372418 -0.0316618 -0.0629726 -0.0624772 -0.0570516 -0.0795194 -0.0879566 0.0527996 -0.0603954 -0.1296023 -0.0290479 0.0645433 0.0670857 -0.0516134 0.0479114 -0.0088055 -0.0107622 0.0813906 -0.0254853 0.0680479 0.0776146 0.0600563 -0.0298907 -0.0897358 -0.0640012 0.0508707 -0.0035976 -0.1071543 -0.04363 -0.0515459 -0.0056449 -0.0392591 0.1098471 -0.0572857 0.0597492 -0.0146441 0.1298409 0.0325598 0.0144355 -0.0016534 0.162439 -0.0246525 0.0713489 -0.0179672 0.0145816 -0.0144956 0.0172574 0.1113752 0.0452112 -0.0768068 -0.0098292 -0.0455163 -0.2474014 -0.0242459 -0.009841 -0.0250137 0.1016134 unknown
polarizability: 98.1640326|6.4479513|73.1064308|3.7653225|2.6427648|37.1897111 unknown
InChI: InChI=1S/C5H7ClO/c1-4(2)5(6)3-7/h3H,1-2H3
charge 0 multiplicity 1
14 atoms
Cl -0.672802 -1.945859 -0.207885
O  -2.585511 0.401102 -0.205339
C  1.103196 0.180423 0.020497
C  2.212517 -0.849588 0.051028
C  1.575973 1.621913 0.097575
C  -0.221937 -0.174508 -0.085022
C  -1.37905 0.743608 -0.108353
H  2.487306 -1.145046 -0.981403
H  3.116549 -0.437352 0.531246
H  1.906182 -1.770394 0.573843
H  2.054995 1.803698 1.079269
H  2.355383 1.791929 -0.669742
H  0.787126 2.374579 -0.044681
H  -1.102227 1.820495 -0.023234
