program: Gaussian 09
title: 000146024
version: EM64L-G09RevD.01
frameworkgroup: C1[X(C12H14N2O4)]
method: RPBEPBE
basis: SDD
operation: Freq
keyword: #p
keyword: freq=noraman
keyword: PBEPBE/SDD
title: #p freq=noraman PBEPBE/SDD
converged: YES YES NO NO
title: Mulliken charges:
elementType: O O O O N N C C C C C C C C C C C C H H H H H H H H H H H H H H
charge: -0.238184 -0.233127 -0.212182 -0.211055 -0.014109 0.010757 -0.567791 -0.368665 0.509015 -0.496292 -0.454152 0.211655 0.188619 -0.334601 -0.259915 0.122469 -0.542543 -0.538336 0.243065 0.228217 0.244143 0.255758 0.262535 0.230441 0.243859 0.317555 0.244917 0.217128 0.250676 0.220360 0.219046 0.250737
chargesum: 0.00000
title: Mulliken charges with hydrogens summed into heavy atoms:
elementType: O O O O N N C C C C C C C C C C C C
charge: -0.238184 -0.233127 -0.212182 -0.211055 -0.014109 0.010757 -0.096510 0.131236 0.509015 -0.233756 -0.223711 0.211655 0.188619 -0.090742 0.057640 0.122469 0.170178 0.151808
polarizability: 1.87285585e+02 -3.85827902e+00 1.83453309e+02 2.87280518e+01 -2.09845581e+00 1.08417481e+02
1716.lowfreq: -6.2969 0.0002 0.0006 0.0007 3.5591 7.9945 20.1498 22.6436 39.7613
frequency: 20.0827 22.4818 39.7403 69.6104 94.3387 97.1578 118.9693 155.9781 182.2574 202.9214 226.3017 241.8479 260.8750 280.6642 309.6609 340.9226 352.0127 369.7752 431.0932 453.5533 455.4837 472.1150 525.9876 531.4954 570.0634 579.7120 607.4667 633.5929 650.2794 686.1155 694.3564 731.2318 741.0616 747.4846 802.5788 857.8612 871.5446 893.6413 912.6018 926.7399 959.8260 982.4121 994.1593 1007.7344 1035.3817 1100.7253 1110.4872 1112.2992 1115.7774 1133.9171 1144.1628 1156.1821 1172.7188 1183.7773 1213.8317 1226.0989 1264.5349 1282.2094 1309.9143 1347.1486 1362.5587 1398.0361 1410.2474 1435.1215 1443.3657 1447.1913 1463.6995 1467.5395 1469.9072 1470.3140 1471.2699 1472.4546 1509.6683 1588.9607 1608.6626 1765.7185 2957.4122 2962.8556 2999.3566 3035.9514 3044.9197 3054.4039 3060.9622 3107.0731 3124.5095 3128.8654 3132.0421 3148.6511 3165.4313 3280.4423
redmass: 8.1648 4.7533 7.8591 4.0171 4.0836 4.0998 3.7639 3.9601 3.6820 3.1312 1.6277 1.4707 2.4164 2.1999 2.9202 3.3359 4.2892 3.7043 4.4752 5.5674 4.9296 3.4653 5.6419 7.5893 5.7605 4.1935 5.6784 3.3711 1.8553 4.1070 2.4557 4.9622 3.3519 8.5230 1.4446 1.6953 2.7023 4.3628 1.4176 3.0671 3.4353 7.4824 3.5364 3.4030 2.6766 4.7325 1.2611 1.2590 2.2488 2.0154 1.5923 1.4100 1.5160 1.4297 1.3019 2.1159 3.3032 1.5304 1.4517 1.3953 1.8717 4.1323 2.8377 1.1861 1.7783 1.5106 1.1239 1.0506 1.0824 1.1088 1.4680 1.0666 2.7343 7.0453 6.4575 11.9892 1.0331 1.0332 1.0605 1.0614 1.1038 1.1043 1.0997 1.1066 1.0896 1.0989 1.0993 1.0909 1.0935 1.0988
irintensity: 4.5886 1.4506 0.0183 4.2069 0.3866 15.7382 0.4634 0.0494 6.7200 0.5664 0.3294 0.6383 0.9155 0.1272 1.7115 1.3160 1.7235 3.5384 5.2478 16.6210 0.9948 3.7539 2.4309 16.7683 13.5607 3.9441 6.8702 6.0542 36.9002 12.8523 32.5274 12.3112 0.5078 9.7012 45.0476 9.2747 12.4673 25.6108 1.8867 9.1906 0.9202 29.8465 36.7065 9.8266 5.9768 8.9961 0.1393 0.5011 31.5969 133.7656 7.7101 12.9293 1.7317 29.0147 12.5914 92.7417 161.0123 21.9175 11.9188 11.7832 5.4514 12.1415 18.0171 12.5847 6.8516 11.7808 7.4276 12.0414 40.6397 45.4601 25.6146 26.7072 121.8503 38.7013 31.6132 461.5987 81.1258 37.6609 24.3404 13.0732 47.5045 38.4751 16.1070 7.2962 20.0613 13.8116 18.7660 9.5674 11.2753 6.9760
temp: 298.150 k
press: 1.00000 atm
elementType: 8 8 8 8 7 7 6 6 6 6 6 6 6 6 6 6 6 6 1 1 1 1 1 1 1 1 1 1 1 1 1 1
symmnumber: 1
zpe: 645998.7 jmol-1
zpe.correction: 0.246048 hartree
zpe.thermalcorrener: 0.263366 hartree
zpe.thermalcorrenthalpy: 0.264310 hartree
zpe.thermalcorrgfe: 0.198973 hartree
zpe.sumelectzpe: -874.630150 hartree
zpe.sumelectthermal: -874.612832 hartree
zpe.sumelectthermalent: -874.611887 hartree
zpe.sumelectthermalfe: -874.677224 hartree
dipole: -4.2142 -6.2725 -0.3096
dipole: 7.5630
quadrupole: -115.5356 -102.6151 -103.5578
quadrupole: -8.5432 7.7374 9.2181
quadrupole: -8.2994 4.6210 3.6784 -8.5432 7.7374 9.2181
hfenergy: -874.8761976 hartree
pointgroup: C01 [X(C12H14N2O4)]
dipole: -1.7540224 2.3918874 0.236788 debye
polarizability: 180.4171496|2.7211517|183.5860222|-35.9254541|-5.6576184|115.1532039 unknown
InChI: InChI=1S/C12H14N2O4/c1-16-10-4-3-9(7-11(10)17-2)5-6-14-8-12(15)18-13-14/h3-4,7-8H,5-6H2,1-2H3
charge 0 multiplicity 1
32 atoms
O  -1.723074 -2.044811 -0.601778
O  -3.675803 -0.892708 0.76207
O  3.938213 -0.5867 -0.539249
O  3.122572 -2.300162 0.974482
N  2.576796 1.03972 0.027753
N  3.600532 0.762738 -0.836933
C  0.728645 2.330787 -1.108579
C  1.929008 2.362902 -0.116404
C  -0.460604 1.512973 -0.62967
C  -0.526494 0.116359 -0.890471
C  -1.501626 2.114161 0.108496
C  -1.59596 -0.669319 -0.410957
C  -2.650629 -0.044851 0.335929
C  -2.589959 1.343217 0.585138
C  2.212105 0.019941 0.86161
C  3.019666 -1.126409 0.584681
C  -0.615539 -2.742407 -1.267911
C  -4.7702 -0.289507 1.526438
H  1.102485 1.962526 -2.08192
H  0.427754 3.385258 -1.255596
H  1.601862 2.690356 0.884176
H  2.708037 3.051058 -0.485748
H  0.268957 -0.355177 -1.476346
H  -1.47964 3.192088 0.308795
H  -3.388976 1.835456 1.14718
H  1.402464 0.105744 1.576135
H  0.331153 -2.623331 -0.706284
H  -0.484587 -2.388721 -2.30903
H  -0.912479 -3.800794 -1.271712
H  -5.306478 0.474382 0.929924
H  -4.403111 0.163851 2.46813
H  -5.447789 -1.124417 1.755948
