program: Gaussian 09
title: 000146020
version: EM64L-G09RevD.01
frameworkgroup: C1[X(C4H13N2O2P)]
method: RPBEPBE
basis: SDD
operation: Freq
keyword: #p
keyword: freq=noraman
keyword: PBEPBE/SDD
title: #p freq=noraman PBEPBE/SDD
converged: YES YES NO NO
title: Mulliken charges:
elementType: P O O N N C C C C H H H H H H H H H H H H H
charge: 1.361956 -0.680143 -0.625516 -0.522764 -0.946571 -0.304756 -0.322477 -0.653083 -0.650337 0.211816 0.229856 0.264791 0.209596 0.252605 0.223238 0.206630 0.211177 0.236801 0.211660 0.355847 0.345848 0.383828
chargesum: 0.00000
title: Mulliken charges with hydrogens summed into heavy atoms:
elementType: P O O N N C C C C
charge: 1.361956 -0.296315 -0.625516 -0.522764 -0.244877 0.136916 0.151910 0.029389 0.009301
polarizability: 8.91090409e+01 -2.03622627e+00 8.74797999e+01 -3.46870078e+00 -1.22156338e+00 7.86807929e+01
1716.lowfreq: -18.9166 -10.6754 -0.0017 0.0008 0.0017 10.8179 20.9154 39.7752 79.9885
frequency: 17.3734 38.9654 79.8365 125.4892 179.8013 200.2583 219.8267 234.1262 252.8839 296.6035 314.7732 327.0017 349.9739 383.3308 406.4522 447.2057 473.7953 507.8092 602.9590 699.9794 770.2423 774.9484 834.7036 903.6634 910.5306 928.3187 993.4894 1033.7785 1067.2402 1086.5504 1089.2263 1093.3594 1183.9746 1198.2413 1289.5328 1328.8430 1349.7607 1355.8271 1383.0380 1394.1214 1455.1005 1463.1485 1468.7926 1469.9185 1481.7021 1487.6949 1559.2967 2980.5714 2983.5652 2988.1889 2993.6636 3047.3165 3069.4356 3078.5686 3080.0522 3095.5423 3101.0909 3539.6785 3595.6318 3690.4610
redmass: 2.4117 4.0354 2.5147 3.3854 1.4013 2.7901 3.1966 1.2139 1.6984 2.6034 2.4238 3.9361 1.8457 1.2844 2.4785 2.6009 3.9727 1.4350 3.4775 6.7861 1.1839 1.2214 4.6241 2.2859 2.2837 1.7679 1.4700 3.0569 2.2770 1.6643 1.8582 2.2520 2.8327 2.2453 1.2115 1.2005 1.2103 1.2342 1.2155 1.1998 1.0659 1.0431 1.0690 1.0475 1.0521 1.0549 1.1041 1.0358 1.0367 1.0671 1.0605 1.1032 1.0979 1.0981 1.0979 1.1009 1.1004 1.0444 1.0658 1.1025
irintensity: 0.8428 2.4247 0.1724 5.7658 2.5877 19.2858 11.8108 0.3974 2.4632 31.4687 6.9728 31.2784 74.9035 2.1536 16.1191 2.2634 32.2639 257.0477 13.1660 288.1351 9.6989 36.5684 119.6882 54.2247 22.8191 27.7256 21.9354 80.9669 3.8632 35.7318 19.1368 144.7107 67.9777 49.8516 22.1598 4.9211 3.4225 6.3769 15.0798 28.0101 3.8668 5.8778 13.1468 16.2986 8.0296 14.2722 63.2937 17.5053 29.9951 28.4301 56.6897 12.0287 18.9129 37.5796 39.7995 33.3031 32.4070 35.9727 48.3904 38.8836
temp: 298.150 k
press: 1.00000 atm
elementType: 15 8 8 7 7 6 6 6 6 1 1 1 1 1 1 1 1 1 1 1 1 1
symmnumber: 1
zpe: 477054.3 jmol-1
zpe.correction: 0.181700 hartree
zpe.thermalcorrener: 0.194336 hartree
zpe.thermalcorrenthalpy: 0.195280 hartree
zpe.thermalcorrgfe: 0.142247 hartree
zpe.sumelectzpe: -760.627469 hartree
zpe.sumelectthermal: -760.614833 hartree
zpe.sumelectthermalent: -760.613889 hartree
zpe.sumelectthermalfe: -760.666922 hartree
dipole: 0.5756 0.5753 -2.8498
dipole: 2.9637
quadrupole: -56.0529 -59.1447 -69.8055
quadrupole: -1.2797 2.5491 -5.1963
quadrupole: 5.6148 2.5230 -8.1378 -1.2797 2.5491 -5.1963
hfenergy: -760.8091693 hartree
pointgroup: C01[X(C4H13N2O2P1)]
dipole: -0.3878093 0.071193 1.0973308 debye
dipolederiv: 2.1928454 -0.2189556 0.2245281 -0.2088844 1.8841321 0.1456545 0.1412423 0.1072753 1.6646356 -0.647597 0.0255579 -0.1670833 0.0153755 -1.1963874 -0.0505426 -0.1413974 0.0346004 -0.4949261 -0.8235999 0.0280637 0.0824913 0.0629938 -0.6955916 -0.0203966 0.0636671 0.0169034 -0.7074581 -1.0178519 0.092796 -0.1330131 -0.0243212 -0.8851513 -0.0172923 -0.0224483 -0.0440852 -0.7076337 -0.8479148 0.1112624 -0.259937 0.1218166 -0.9445194 -0.0752323 -0.2925392 -0.1480687 -0.7924755 0.086186 0.0165001 0.0091844 -0.166757 0.6840829 0.0582692 -0.0119532 0.0374342 0.3126503 0.5733504 0.176222 0.1286384 0.33232 0.167556 0.0241733 0.2507758 0.0032319 0.353097 0.0481771 -0.0227326 0.0391668 0.009311 -0.1278208 0.0742237 0.0268743 0.1465326 -0.0535211 -0.0617122 -0.0367604 -0.0896122 -0.0073713 0.0835112 0.0404161 -0.1379722 0.0153529 -0.1475241 -0.1279407 0.0317534 0.1278509 0.0163983 0.0057654 0.0233304 0.09054 0.0170489 0.0424055 0.0235209 -0.0787638 -0.1475217 -0.0189704 -0.0076589 -0.0166978 -0.0944365 -0.0245189 -0.0727284 0.1140875 0.0320622 -0.0366152 -0.0160298 -0.0725484 0.0124312 -0.0554045 -0.0170122 0.0631567 -0.1337516 -0.0171804 0.0879229 0.029794 0.0958867 -0.0578283 0.0850609 -0.0193916 -0.1060473 -0.0711003 -0.0040067 0.0680292 0.0288439 0.1144312 -0.0085507 0.0499302 0.0163006 0.0500437 -0.0295609 -0.0081728 -0.1189945 -0.0380808 0.1014653 -0.0229491 -0.1097215 0.0012388 -0.0522987 0.096292 0.0347308 0.0062553 0.0370155 -0.1944873 -0.0730681 0.0083436 -0.1012573 0.0505598 0.0778975 0.0841832 -0.0019433 0.1082259 -0.1416685 0.030574 0.0048931 -0.0133769 0.0563393 -0.0064959 0.0256239 0.1276548 0.0293769 0.0877671 0.0003703 0.0831914 -0.0005444 -0.0246271 -0.100406 -0.129137 -0.0706007 -0.1545731 -0.020694 -0.0430997 -0.0693482 -0.0209232 0.0691034 0.1886803 -0.0409183 0.0236913 -0.0517557 0.371444 0.0004446 -0.0288047 -0.0065978 0.1599272 0.2012484 -0.0897757 -0.0111209 -0.1045516 0.349667 -0.0066569 0.0243384 0.0159837 0.128222 0.2656458 -0.0123524 0.1110284 -0.0001762 0.3408187 -0.0175732 0.1351685 -0.0161266 0.2090995 unknown
polarizability: 90.897508|0.397693|84.999613|0.1668028|3.967711|79.3725127 unknown
InChI: InChI=1S/C4H13N2O2P/c1-3-6(4-2)9(5,7)8/h7H,3-5H2,1-2H3
charge 0 multiplicity 1
22 atoms
P  1.026546 -0.623078 0.14583
O  0.786129 -2.355048 0.232696
O  1.681596 -0.205734 -1.255306
N  -0.547001 -0.121774 0.677785
N  2.031592 -0.134114 1.446785
C  -0.722472 1.308127 1.063274
C  -1.755418 -0.902321 0.301719
C  -0.553665 2.341038 -0.076928
C  -2.380668 -0.554326 -1.06931
H  -1.734626 1.383467 1.503344
H  -0.000442 1.542813 1.867459
H  -1.476796 -1.968454 0.324969
H  -2.498903 -0.741266 1.107083
H  0.451499 2.265501 -0.528558
H  -1.293992 2.189958 -0.880548
H  -0.677544 3.364952 0.323868
H  -2.769998 0.478696 -1.095783
H  -1.635545 -0.662558 -1.877746
H  -3.223796 -1.239003 -1.280536
H  2.991407 0.142844 1.249043
H  1.781092 -0.327685 2.41518
H  1.295305 -2.817336 -0.480722
